{"text_format":"1","workbook":"xlsx","n_sheets":15,"sheets":["Inputs","Results","Graphs","Calculations","graphing","Grand Island","Ainsworth","Lincoln","Norfolk","North Platte","Alliance","Scottsbluff","Beatrice","Base Setback","Alt setback"],"not_rendered":{"charts":8,"images":16,"macros":1,"external_links":0,"defined_names":5,"comments":3,"pivot_tables":0},"unopened":[],"bounds":{"document_bytes":16777216,"sheet_cells":100000,"rows_first":2000,"rows_last":500,"rows_between":2000,"halvings":0,"cell_chars":16384,"cell_head_chars":4096},"cells_cut":0,"cells_raw":0,"read":"whole","date_system":"1900"}

{"sheet":"Inputs","index":0,"n_rows":74,"n_cols":37,"rows_kept":74,"cut":false,"hidden":false,"merged":[[48,4,48,7],[2,1,2,8],[7,3,7,5],[25,2,25,3],[37,2,37,3],[3,1,3,8],[5,3,5,5],[32,6,32,7],[35,2,35,3],[21,2,22,2],[41,2,41,3],[9,4,9,5]]}
[null,null,null,null,null,null,null,null,null,null,null,null,null,null,null,null,null,null,null,null,"Regions:","Sources:","#","Facility Type:","Emission #","Source #","Odor Control:",null,null,"Terrain:","Scaling","Percentages:","Number of Facilities:","Errors:"]
[]
[null,"NEBRASKA ODOR FOOTPRINT TOOL",null,null,null,null,null,null,null,null,null,null,null,null,null,null,null,null,null,null,"Ainsworth, Neb. (North-central Neb.)","Poultry, Broiler",1,"Floor-raised on litter",10,1,"Biofilter: Receiving 100% from exhaust fans",0.1,1,"Flat terrain",1,90,1,"Update facility!"]
[null,"Inputs for the Calculation of Separation Distances",null,null,null,null,null,null,null,null,null,null,null,null,null,null,null,null,null,null,"Alliance, Neb. (Neb. Panhandle)","Poultry, Turkey",2,"Litter",10,2,"Biofilter: Cool weather ventilation ",0.4,1,"Unconfined, low-lying area",1,94,2,{"$f":"MATCH(E$13,$V$3:$V$12,0)","v":{"$error":"#N/A"}},{"$f":"MATCH(F$13,$V$3:$V$12,0)","v":{"$error":"#N/A"}},{"$f":"MATCH(G$13,$V$3:$V$12,0)","v":{"$error":"#N/A"}},{"$f":"MATCH(H$13,$V$3:$V$12,0)","v":{"$error":"#N/A"}}]
[null,null,null,null,null,null,null,null,null,null,null,null,null,null,null,null,null,null,null,null,"Beatrice, Neb. (Southeast Neb.)","Swine, Farrowing Bldg",3,"Shallow pit Far (pull plug)",70,3,"Biofilter: Minimum Airflow treated",0.7,1,"Confined air drainage zone",1,96,3,{"$f":"VLOOKUP(E$15,$X$2:$Z$24,3,FALSE)","v":{"$error":"#N/A"}},{"$f":"VLOOKUP(F$15,$X$2:$Z$24,3,FALSE)","v":{"$error":"#N/A"}},{"$f":"VLOOKUP(G$15,$X$2:$Z$24,3,FALSE)","v":{"$error":"#N/A"}},{"$f":"VLOOKUP(H$15,$X$2:$Z$24,3,FALSE)","v":{"$error":"#N/A"}}]
[null,null,"Project title:",null,null,null,"Prepared for:",null,null,null,null,null,null,null,null,null,null,null,null,null,"Grand Island, Neb. (South-central Neb.)","Swine, Nursery Bldg",4,"Deep pit or Shallow pit",205,4,"Oil sprinkling used to control dust",0.8,1,"Rolling terrain",1,98,4,"Enter only a) Height and Width or b) Diameter"]
[null,null,null,null,null,null,null,null,null,null,null,null,null,null,null,null,null,null,null,null,"Lincoln, Neb. (Salt flats)","Swine, Gestation Bldg",5,"Deep pit Ges",245,5,"No supplemental odor control implemented",1,1,"High Relief or intervening terrain",1,99,5,"Not included, see note"]
[null,null,"Site location:",null,null,null,"Prepared by:",null,null,null,null,null,null,null,null,null,null,null,null,null,"Norfolk, Neb. (Northeast Neb.)","Swine, Finishing Bldg",6,"Shallow pit Ges (pull plug)",145,5,null,null,null,null,null,null,6,"Update odor control!"]
[null,null,null,null,null,null,null,null,null,null,null,null,null,null,null,null,null,null,null,null,"North Platte, Neb. (Southwest Neb.)","Cattle, Beef",7,"Deep pit Fin",165,6,"Impermeable cover",0.1,2,null,null,null,7,{"$f":"IF(MATCH(E$13,$V$3:$V$12,0)<9,1,2)","v":{"$error":"#N/A"}},{"$f":"IF(MATCH(F$13,$V$3:$V$12,0)<9,1,2)","v":{"$error":"#N/A"}},{"$f":"IF(MATCH(G$13,$V$3:$V$12,0)<9,1,2)","v":{"$error":"#N/A"}},{"$f":"IF(MATCH(H$13,$V$3:$V$12,0)<9,1,2)","v":{"$error":"#N/A"}}]
[null,null,"Location for weather data:",null,"Ainsworth, Neb. (North-central Neb.)",null,"Date prepared:",null,null,null,null,null,null,null,null,null,null,null,null,null,"Scottsbluff, Neb. (N. Platte River Valley)","Cattle, Dairy",8,"Shallow pit Fin (pull plug)",95,6,"Straw 8\" thick",0.3,2,null,null,null,8,{"$f":"IF(ISERROR(VLOOKUP(E$26,$AA$3:$AC$19,3,FALSE)),\"\",VLOOKUP(E$26,$AA$3:$AC$19,3,FALSE))","v":""},{"$f":"IF(ISERROR(VLOOKUP(F$26,$AA$3:$AC$19,3,FALSE)),\"\",VLOOKUP(F$26,$AA$3:$AC$19,3,FALSE))","v":""},{"$f":"IF(ISERROR(VLOOKUP(G$26,$AA$3:$AC$19,3,FALSE)),\"\",VLOOKUP(G$26,$AA$3:$AC$19,3,FALSE))","v":""},{"$f":"IF(ISERROR(VLOOKUP(H$26,$AA$3:$AC$19,3,FALSE)),\"\",VLOOKUP(H$26,$AA$3:$AC$19,3,FALSE))","v":""}]
[null,null,null,null,null,null,null,null,null,null,null,null,null,null,null,null,null,null,null,null,null,"Manure Storage",9,"Deep-bedded, scrape",20,6,"Straw 6\" thick",0.4,2,null,null,null,9,{"$f":"IF(ISERROR(VLOOKUP(E$36,$AA$3:$AC$19,3,FALSE)),\"\",VLOOKUP(E$36,$AA$3:$AC$19,3,FALSE))","v":""},{"$f":"IF(ISERROR(VLOOKUP(F$36,$AA$3:$AC$19,3,FALSE)),\"\",VLOOKUP(F$36,$AA$3:$AC$19,3,FALSE))","v":""},"",""]
[null,null,"BASE PLAN",null,"Source Facility 1","Source Facility 2 ","Source Facility 3","Source Facility 4",null,null,null,null,null,null,null,null,null,null,null,null,null,"Manure Treatment Facility",10,"Cargil/Open-front, scrape",20,6,"Geotextile cover (at least 2.4 mm thick)",0.5,2,null,null,null,10]
[null,null,"Select odor sources:",null,null,null,null,null,null,null,null,null,null,null,null,null,null,null,null,null,null,null,null,"Loose housing, scrape",55,6,"Straw 4\" thick",0.5,2]
[null,null,null,null,null,null,null,null,null,null,null,null,null,null,null,null,null,null,null,null,null,null,null,"Open concrete lot, scrape",55,6,"Straw 2\" thick",0.6,2]
[null,null,"Select type of facility:",null,null,null,null,null,null,null,null,null,null,null,null,null,null,null,null,null,null,null,null,"Dirt lot (area is regularly dry)","Not available",7," No supplemental odor control implemented",1,2]
[null,null,null,null,{"$f":"IF(OR(ISERROR(AH4),ISERROR(AH5)),\"\",IF(AH4=AH5,\"\",$AH$3))","v":""},{"$f":"IF(OR(ISERROR(AI4),ISERROR(AI5)),\"\",IF(AI4=AI5,\"\",$AH$3))","v":""},{"$f":"IF(OR(ISERROR(AJ4),ISERROR(AJ5)),\"\",IF(AJ4=AJ5,\"\",$AH$3))","v":""},{"$f":"IF(OR(ISERROR(AK4),ISERROR(AK5)),\"\",IF(AK4=AK5,\"\",$AH$3))","v":""},null,null,null,null,null,null,null,null,null,null,null,null,null,null,null,"Scraped freestall barn",30,8]
[null,null,"Number of identical facilities:",null,1,1,1,1,null,null,null,null,null,null,null,null,null,null,null,null,null,null,null,"Slatted-floor barn over deep pit",30,8]
[null,null,null,null,{"$f":"IF(OR(E15=$X$23,E15=$X$24,E15=$X$15),$AH$7,\"\")","v":""},{"$f":"IF(OR(F15=$X$23,F15=$X$24,F15=$X$15),$AH$7,\"\")","v":""},{"$f":"IF(OR(G15=$X$23,G15=$X$24,G15=$X$15),$AH$7,\"\")","v":""},{"$f":"IF(OR(H15=$X$23,H15=$X$24,H15=$X$15),$AH$7,\"\")","v":""},null,null,null,null,null,null,null,null,null,null,null,null,null,null,null,"Loose housing, scraped",30,8]
[null,null,"Number of animals per facility:",null,null,null,null,null,null,null,null,null,null,null,null,null,null,null,null,null,null,null,null,"Tiestall barn",10,8]
[null,null,null,null,null,null,null,null,null,null,null,null,null,null,null,null,null,null,null,null,null,null,null,"Earthen basin",65,9]
[null,null,"Facility plan dimensions:",null,null,null,null,null,null,null,null,null,null,null,null,null,null,null,null,null,null,null,null,"Steel/concrete tank",135,9]
[null,null,"   a) Length & Width","(ft)",null,null,null,null,null,null,null,null,null,null,null,null,null,null,null,null,null,null,null,"Crusted stockpile",10,9]
[null,null,null,"(ft)",null,null,null,null,null,null,null,null,null,null,null,null,null,null,null,null,null,null,null,"Anaerobic lagoon: low solids loading","To be determined",10]
[null,null,"OR b) Diameter:","(ft)",null,null,null,null,null,null,null,null,null,null,null,null,null,null,null,null,null,null,null,"Anaerobic lagoon: high solids loading","To be determined",10]
[null,null,null,null,{"$f":"IF(AND(OR(ISBLANK(E24),AND(ISBLANK(E22),ISBLANK(E23))),OR(ISBLANK(F24),AND(ISBLANK(F22),ISBLANK(F23))),OR(ISBLANK(G24),AND(ISBLANK(G22),ISBLANK(G23))),OR(ISBLANK(H24),AND(ISBLANK(H22),ISBLANK(H23)))),\"\",AH6)","v":""}]
[null,null,"Select odor control used in Base Plan:"]
[null,null,null,null,{"$f":"IF(ISERROR(AH9),\"\",IF(AH9=AH10,\"\",$AH$8))","v":""},{"$f":"IF(ISERROR(AI9),\"\",IF(AI9=AI10,\"\",$AH$8))","v":""},"","",null,null,null,null,null,null,null,null,null,null,null,null,null,"To determine first four:",null,{"$f":"IF(G13=$V7,$X$7:$X$8,IF(OR(G13=$V5,G13=$V6,G13=$V3,G13=$V4),VLOOKUP(G13,$V3:$X6,3,FALSE),IF(G13=$V8,$X$9:$X$14,IF(G13=$V11,$X$20:$X$22,IF(G13=$V12,$X$23:$X24,IF(G13=$V9,$X$15:$X$15,IF(G13=$V10,$X$16:$X$19,$AB2)))))))","v":0},{"$f":"IF(H13=$V7,$X$7:$X$8,IF(OR(H13=$V5,H13=$V6,H13=$V3,H13=$V4),VLOOKUP(H13,$V3:$X6,3,FALSE),IF(H13=$V8,$X$9:$X$14,IF(H13=$V11,$X$20:$X$22,IF(H13=$V12,$X$23:$X24,IF(H13=$V9,$X$15:$X$15,IF(H13=$V10,$X$16:$X$19,$AB2)))))))","v":0}]
[null,null,"Total plan area:","(sq. ft.)",{"$f":"IF(OR(ISBLANK(E15),ISBLANK(E13)),\"\",IF(AND(ISBLANK(E24),ISBLANK(E23)),\"\",IF(AND(ISBLANK(E22),ISBLANK(E24)),\"\",IF(AND(ISBLANK(E22),ISBLANK(E23)),E17*PI()*(E24/2)^2,IF(ISBLANK(E24),E17*E22*E23,\"\")))))","v":""},{"$f":"IF(OR(ISBLANK(F15),ISBLANK(F13)),\"\",IF(AND(ISBLANK(F24),ISBLANK(F23)),\"\",IF(AND(ISBLANK(F22),ISBLANK(F24)),\"\",IF(AND(ISBLANK(F22),ISBLANK(F23)),F17*PI()*(F24/2)^2,IF(ISBLANK(F24),F17*F22*F23,\"\")))))","v":""},{"$f":"IF(OR(ISBLANK(G15),ISBLANK(G13)),\"\",IF(AND(ISBLANK(G24),ISBLANK(G23)),\"\",IF(AND(ISBLANK(G22),ISBLANK(G24)),\"\",IF(AND(ISBLANK(G22),ISBLANK(G23)),G17*PI()*(G24/2)^2,IF(ISBLANK(G24),G17*G22*G23,\"\")))))","v":""},{"$f":"IF(OR(ISBLANK(H15),ISBLANK(H13)),\"\",IF(AND(ISBLANK(H24),ISBLANK(H23)),\"\",IF(AND(ISBLANK(H22),ISBLANK(H24)),\"\",IF(AND(ISBLANK(H22),ISBLANK(H23)),H17*PI()*(H24/2)^2,IF(ISBLANK(H24),H17*H22*H23,\"\")))))","v":""},null,null,null,null,null,null,null,null,null,null,null,null,null,null,null,{"$f":"IF(E13=$V7,$X$7:$X$8,IF(OR(E13=$V5,E13=$V6,E13=$V3,E13=$V4),VLOOKUP(E13,$V3:$X6,3,FALSE),IF(E13=$V8,$X$9:$X$14,IF(E13=$V11,$X$20:$X$22,IF(E13=$V12,$X$23:$X24,IF(E13=$V9,$X$15:$X$15,IF(E13=$V10,$X$16:$X$19,$AB2)))))))","v":0},{"$f":"IF(F13=$V7,$X$7:$X$8,IF(OR(F13=$V5,F13=$V6,F13=$V3,F13=$V4),VLOOKUP(F13,$V3:$X6,3,FALSE),IF(F13=$V8,$X$9:$X$14,IF(F13=$V11,$X$20:$X$22,IF(F13=$V12,$X$23:$X24,IF(F13=$V9,$X$15:$X$15,IF(F13=$V10,$X$16:$X$19,$AB2)))))))","v":0}]
[null,null,"OFT odor emission number*:",null,{"$f":"IF(E28=\"\",\"\",VLOOKUP(E15,$X3:$Y24,2,FALSE))","v":""},{"$f":"IF(F28=\"\",\"\",VLOOKUP(F15,$X3:$Y24,2,FALSE))","v":""},{"$f":"IF(G28=\"\",\"\",VLOOKUP(G15,$X3:$Y24,2,FALSE))","v":""},{"$f":"IF(H28=\"\",\"\",VLOOKUP(H15,$X3:$Y24,2,FALSE))","v":""}]
[null,null,"Odor control factor:",null,{"$f":"IF(ISBLANK(E13),\"\",IF(ISERROR(VLOOKUP(E26,Inputs!$AA$3:$AB$19,2,FALSE)),\"\",VLOOKUP(E26,Inputs!$AA$3:$AB$19,2,FALSE)))","v":""},{"$f":"IF(ISBLANK(F13),\"\",IF(ISERROR(VLOOKUP(F26,Inputs!$AA$3:$AB$19,2,FALSE)),\"\",VLOOKUP(F26,Inputs!$AA$3:$AB$19,2,FALSE)))","v":""},{"$f":"IF(ISBLANK(G13),\"\",IF(ISERROR(VLOOKUP(G26,Inputs!$AA$3:$AB$19,2,FALSE)),\"\",VLOOKUP(G26,Inputs!$AA$3:$AB$19,2,FALSE)))","v":""},{"$f":"IF(ISBLANK(H13),\"\",IF(ISERROR(VLOOKUP(H26,Inputs!$AA$3:$AB$19,2,FALSE)),\"\",VLOOKUP(H26,Inputs!$AA$3:$AB$19,2,FALSE)))","v":""}]
[null,null,"Facility odor emission rate*:   ","(106 OU/s)",{"$f":"IF(ISERROR(E28*E29*E30),\"\",E28*E29*E30/10^6)","v":""},{"$f":"IF(ISERROR(F28*F29*F30),\"\",F28*F29*F30/10^6)","v":""},{"$f":"IF(ISERROR(G28*G29*G30),\"\",G28*G29*G30/10^6)","v":""},{"$f":"IF(ISERROR(H28*H29*H30),\"\",H28*H29*H30/10^6)","v":""}]
[null,null,"Percentage of total odor:",null,{"$f":"IF(E31=\"\",\"\",E31/(SUM($E$31:$H$31)))","v":""},{"$f":"IF(F31=\"\",\"\",F31/(SUM($E$31:$H$31)))","v":""},{"$f":"IF(G31=\"\",\"\",G31/(SUM($E$31:$H$31)))","v":""},{"$f":"IF(H31=\"\",\"\",H31/(SUM($E$31:$H$31)))","v":""}]
[null,null,"Total odor emission rate*:",null,{"$f":"IF(SUM(E31:H31)>0,SUM(E31:H31),\"\")","v":""},"x 106 OU/s","* The emission values shown have been scaled up - based upon calibration study results - for use with the Odor Footprint Tool."]
[]
[null,null,"ALTERNATE PLAN",null,"Source Facilty 1","Source Facility 2 ","Source Facility 3","Source Facility 4"]
[null,null,"Select odor control option being considered:"]
[]
[null,null,"Odor control factor:",null,{"$f":"IF(ISERROR(VLOOKUP(E36,Inputs!$AA$3:$AB$19,2,FALSE)),\"\",VLOOKUP(E36,Inputs!$AA$3:$AB$19,2,FALSE))","v":""},{"$f":"IF(ISERROR(VLOOKUP(F36,Inputs!$AA$3:$AB$19,2,FALSE)),\"\",VLOOKUP(F36,Inputs!$AA$3:$AB$19,2,FALSE))","v":""},{"$f":"IF(ISERROR(VLOOKUP(G36,Inputs!$AA$3:$AB$19,2,FALSE)),\"\",VLOOKUP(G36,Inputs!$AA$3:$AB$19,2,FALSE))","v":""},{"$f":"IF(ISERROR(VLOOKUP(H36,Inputs!$AA$3:$AB$19,2,FALSE)),\"\",VLOOKUP(H36,Inputs!$AA$3:$AB$19,2,FALSE))","v":""},null,null,null,null,null,null,null,null,null,null,null,null,"Refresh facility!"]
[null,null,"Facility odor emission rate*:   ","(106 OU/s)",{"$f":"IF(ISERROR(E31*E38),\"\",E31*E38)","v":""},{"$f":"IF(ISERROR(F31*F38),\"\",F31*F38)","v":""},{"$f":"IF(ISERROR(G31*G38),\"\",G31*G38)","v":""},{"$f":"IF(ISERROR(H31*H38),\"\",H31*H38)","v":""}]
[null,null,"New Percentage of total odor:",null,{"$f":"IF(E39=\"\",\"\",E39/(SUM($E$39:$H$39)))","v":""},{"$f":"IF(F39=\"\",\"\",F39/(SUM($E$39:$H$39)))","v":""},{"$f":"IF(G39=\"\",\"\",G39/(SUM($E$39:$H$39)))","v":""},{"$f":"IF(H39=\"\",\"\",H39/(SUM($E$39:$H$39)))","v":""}]
[]
[null,null,"New total odor emission rate*:",null,{"$f":"IF((IF(ISERROR(E31*E38),0,E31*E38)+IF(ISERROR(F31*F38),0,F31*F38)+IF(ISERROR(G31*G38),0,G31*G38)+IF(ISERROR(H31*H38),0,H31*H38)+IF(ISERROR(#REF!*#REF!),0,#REF!*#REF!))>0,IF(ISERROR(E31*E38),0,E31*E38)+IF(ISERROR(F31*F38),0,F31*F38)+IF(ISERROR(G31*G38),0,G31*G38)+IF(ISERROR(H31*H38),0,H31*H38)+IF(ISERROR(#REF!*#REF!),0,#REF!*#REF!),\"\")","v":""},"x 106 OU/s"]
[null,null,null,null,{"$f":"IF(ISERROR(AH9),\"\",IF(AH9=AH11,\"\",$AH$8))","v":""},{"$f":"IF(ISERROR(AI9),\"\",IF(AI9=AI11,\"\",$AH$8))","v":""},"","",null,null,null,null,null,null,null,null,null,null,null,null,null,null,null,{"$f":"IF(H13=$V7,$X$7:$X$8,IF(OR(H13=$V5,H13=$V6,H13=$V3,H13=$V4),#REF!,IF(H13=$V8,$X$9:$X$14,IF(H13=$V11,$X$20:$X$22,IF(H13=$V12,$X$23:$X$24,IF(H13=$V9,$X$15:$X$15,IF(H13=$V10,$X$16:$X$19,$AB2)))))))","v":0}]
[null,null,null,null,{"$f":"IF(OR($E$10=Inputs!$U$4,$E$10=Inputs!$U$5,$E$10=$U$6, $E$10=Inputs!$U$7),\"North\",\"Northeast\")","v":"Northeast"},{"$f":"IF(OR($E$10=Inputs!$U$4,$E$10=Inputs!$U$5,$E$10=$U$6, $E$10=Inputs!$U$7),\"East\",\"Southeast\")","v":"Southeast"},{"$f":"IF(OR($E$10=Inputs!$U$4,$E$10=Inputs!$U$5,$E$10=$U$6, $E$10=Inputs!$U$7),\"South\",\"Southwest\")","v":"Southwest"},{"$f":"IF(OR($E$10=Inputs!$U$4,$E$10=Inputs!$U$5,$E$10=$U$6, $E$10=Inputs!$U$7),\"West\",\"Northwest\")","v":"Northwest"},null,null,null,null,null,null,null,null,null,null,null,null,{"$f":"IF(E13=$V7,$X$7:$X$8,IF(OR(E13=$V5,E13=$V6,E13=$V3,E13=$V4),X28,IF(E13=$V8,$X$9:$X$14,IF(E13=$V11,$X$20:$X$22,IF(E13=$V12,$X$23:$X$24,IF(E13=$V9,$X$15:$X$15,IF(E13=$V10,$X$16:$X$19,$AB2)))))))","v":0},{"$f":"IF(F13=$V7,$X$7:$X$8,IF(OR(F13=$V5,F13=$V6,F13=$V3,F13=$V4),Y28,IF(F13=$V8,$X$9:$X$14,IF(F13=$V11,$X$20:$X$22,IF(F13=$V12,$X$23:$X$24,IF(F13=$V9,$X$15:$X$15,IF(F13=$V10,$X$16:$X$19,$AB2)))))))","v":0},{"$f":"IF(G13=$V7,$X$7:$X$8,IF(OR(G13=$V5,G13=$V6,G13=$V3,G13=$V4),#REF!,IF(G13=$V8,$X$9:$X$14,IF(G13=$V11,$X$20:$X$22,IF(G13=$V12,$X$23:$X$24,IF(G13=$V9,$X$15:$X$15,IF(G13=$V10,$X$16:$X$19,$AB2)))))))","v":0}]
[null,null,"SELECT TERRAIN",null,"Flat terrain","Flat terrain","Flat terrain","Flat terrain"]
[]
[null,null,null,"Funding provided by: The Nebraska Environmental Trust"]
[null,null,null,null,"               Pork Checkoff"]
[null,null,null,null,"Separation Distance (miles)"]
[null,null,null,null,{"$f":"IF(OR($E$10=Inputs!$U$4,$E$10=Inputs!$U$5,$E$10=$U$6, $E$10=Inputs!$U$7),\"North\",\"Northeast\")","v":"Northeast"},{"$f":"IF(OR($E$10=Inputs!$U$4,$E$10=Inputs!$U$5,$E$10=$U$6, $E$10=Inputs!$U$7),\"East\",\"Southeast\")","v":"Southeast"},{"$f":"IF(OR($E$10=Inputs!$U$4,$E$10=Inputs!$U$5,$E$10=$U$6, $E$10=Inputs!$U$7),\"South\",\"Southwest\")","v":"Southwest"},{"$f":"IF(OR($E$10=Inputs!$U$4,$E$10=Inputs!$U$5,$E$10=$U$6, $E$10=Inputs!$U$7),\"West\",\"Northwest\")","v":"Northwest"}]
[null,null,"BASE PLAN",0.9,{"$f":"IF($E$33=\"\",\"\",INDEX('Base Setback'!$B$3:$F$10,MATCH(Inputs!$E$10,'Base Setback'!$A$3:$A$10,0),MATCH(Inputs!D51,'Base Setback'!$B$2:$F$2,0)))","v":""},{"$f":"IF($E$33=\"\",\"\",INDEX('Base Setback'!$B$14:$F$21,MATCH(Inputs!$E$10,'Base Setback'!$A$14:$A$21,0),MATCH(Inputs!D51,'Base Setback'!$B$13:$F$13,0)))","v":""},{"$f":"IF($E$33=\"\",\"\",INDEX('Base Setback'!$B$25:$F$32,MATCH(Inputs!$E$10,'Base Setback'!$A$25:$A$32,0),MATCH(Inputs!D51,'Base Setback'!$B$24:$F$24,0)))","v":""},{"$f":"IF($E$33=\"\",\"\",INDEX('Base Setback'!$B$36:$F$43,MATCH(Inputs!$E$10,'Base Setback'!$A$36:$A$43,0),MATCH(Inputs!D51,'Base Setback'!$B$35:$F$35,0)))","v":""}]
[null,null,null,0.94,{"$f":"IF($E$33=\"\",\"\",INDEX('Base Setback'!$B$3:$F$10,MATCH(Inputs!$E$10,'Base Setback'!$A$3:$A$10,0),MATCH(Inputs!D52,'Base Setback'!$B$2:$F$2,0)))","v":""},{"$f":"IF($E$33=\"\",\"\",INDEX('Base Setback'!$B$14:$F$21,MATCH(Inputs!$E$10,'Base Setback'!$A$14:$A$21,0),MATCH(Inputs!D52,'Base Setback'!$B$13:$F$13,0)))","v":""},{"$f":"IF($E$33=\"\",\"\",INDEX('Base Setback'!$B$25:$F$32,MATCH(Inputs!$E$10,'Base Setback'!$A$25:$A$32,0),MATCH(Inputs!D52,'Base Setback'!$B$24:$F$24,0)))","v":""},{"$f":"IF($E$33=\"\",\"\",INDEX('Base Setback'!$B$36:$F$43,MATCH(Inputs!$E$10,'Base Setback'!$A$36:$A$43,0),MATCH(Inputs!D52,'Base Setback'!$B$35:$F$35,0)))","v":""}]
[null,null,null,0.96,{"$f":"IF($E$33=\"\",\"\",INDEX('Base Setback'!$B$3:$F$10,MATCH(Inputs!$E$10,'Base Setback'!$A$3:$A$10,0),MATCH(Inputs!D53,'Base Setback'!$B$2:$F$2,0)))","v":""},{"$f":"IF($E$33=\"\",\"\",INDEX('Base Setback'!$B$14:$F$21,MATCH(Inputs!$E$10,'Base Setback'!$A$14:$A$21,0),MATCH(Inputs!D53,'Base Setback'!$B$13:$F$13,0)))","v":""},{"$f":"IF($E$33=\"\",\"\",INDEX('Base Setback'!$B$25:$F$32,MATCH(Inputs!$E$10,'Base Setback'!$A$25:$A$32,0),MATCH(Inputs!D53,'Base Setback'!$B$24:$F$24,0)))","v":""},{"$f":"IF($E$33=\"\",\"\",INDEX('Base Setback'!$B$36:$F$43,MATCH(Inputs!$E$10,'Base Setback'!$A$36:$A$43,0),MATCH(Inputs!D53,'Base Setback'!$B$35:$F$35,0)))","v":""}]
[null,null,null,0.98,{"$f":"IF($E$33=\"\",\"\",INDEX('Base Setback'!$B$3:$F$10,MATCH(Inputs!$E$10,'Base Setback'!$A$3:$A$10,0),MATCH(Inputs!D54,'Base Setback'!$B$2:$F$2,0)))","v":""},{"$f":"IF($E$33=\"\",\"\",INDEX('Base Setback'!$B$14:$F$21,MATCH(Inputs!$E$10,'Base Setback'!$A$14:$A$21,0),MATCH(Inputs!D54,'Base Setback'!$B$13:$F$13,0)))","v":""},{"$f":"IF($E$33=\"\",\"\",INDEX('Base Setback'!$B$25:$F$32,MATCH(Inputs!$E$10,'Base Setback'!$A$25:$A$32,0),MATCH(Inputs!D54,'Base Setback'!$B$24:$F$24,0)))","v":""},{"$f":"IF($E$33=\"\",\"\",INDEX('Base Setback'!$B$36:$F$43,MATCH(Inputs!$E$10,'Base Setback'!$A$36:$A$43,0),MATCH(Inputs!D54,'Base Setback'!$B$35:$F$35,0)))","v":""}]
[null,null,null,0.99,{"$f":"IF($E$33=\"\",\"\",INDEX('Base Setback'!$B$3:$F$10,MATCH(Inputs!$E$10,'Base Setback'!$A$3:$A$10,0),MATCH(Inputs!D55,'Base Setback'!$B$2:$F$2,0)))","v":""},{"$f":"IF($E$33=\"\",\"\",INDEX('Base Setback'!$B$14:$F$21,MATCH(Inputs!$E$10,'Base Setback'!$A$14:$A$21,0),MATCH(Inputs!D55,'Base Setback'!$B$13:$F$13,0)))","v":""},{"$f":"IF($E$33=\"\",\"\",INDEX('Base Setback'!$B$25:$F$32,MATCH(Inputs!$E$10,'Base Setback'!$A$25:$A$32,0),MATCH(Inputs!D55,'Base Setback'!$B$24:$F$24,0)))","v":""},{"$f":"IF($E$33=\"\",\"\",INDEX('Base Setback'!$B$36:$F$43,MATCH(Inputs!$E$10,'Base Setback'!$A$36:$A$43,0),MATCH(Inputs!D55,'Base Setback'!$B$35:$F$35,0)))","v":""}]
[]
[null,null,"ALTERNATE PLAN",0.9,{"$f":"IF($E$33=\"\",\"\",INDEX('Alt setback'!$B$3:$F$10,MATCH(Inputs!$E$10,'Alt setback'!$A$3:$A$10,0),MATCH(Inputs!D57,'Alt setback'!$B$2:$F$2,0)))","v":""},{"$f":"IF($E$33=\"\",\"\",INDEX('Alt setback'!$B$14:$F$21,MATCH(Inputs!$E$10,'Alt setback'!$A$14:$A$21,0),MATCH(Inputs!D57,'Alt setback'!$B$13:$F$13,0)))","v":""},{"$f":"IF($E$33=\"\",\"\",INDEX('Alt setback'!$B$25:$F$32,MATCH(Inputs!$E$10,'Alt setback'!$A$25:$A$32,0),MATCH(Inputs!D57,'Alt setback'!$B$24:$F$24,0)))","v":""},{"$f":"IF($E$33=\"\",\"\",INDEX('Alt setback'!$B$36:$F$43,MATCH(Inputs!$E$10,'Alt setback'!$A$36:$A$43,0),MATCH(Inputs!D57,'Alt setback'!$B$35:$F$35,0)))","v":""}]
[null,null,null,0.94,{"$f":"IF($E$33=\"\",\"\",INDEX('Alt setback'!$B$3:$F$10,MATCH(Inputs!$E$10,'Alt setback'!$A$3:$A$10,0),MATCH(Inputs!D58,'Alt setback'!$B$2:$F$2,0)))","v":""},{"$f":"IF($E$33=\"\",\"\",INDEX('Alt setback'!$B$14:$F$21,MATCH(Inputs!$E$10,'Alt setback'!$A$14:$A$21,0),MATCH(Inputs!D58,'Alt setback'!$B$13:$F$13,0)))","v":""},{"$f":"IF($E$33=\"\",\"\",INDEX('Alt setback'!$B$25:$F$32,MATCH(Inputs!$E$10,'Alt setback'!$A$25:$A$32,0),MATCH(Inputs!D58,'Alt setback'!$B$24:$F$24,0)))","v":""},{"$f":"IF($E$33=\"\",\"\",INDEX('Alt setback'!$B$36:$F$43,MATCH(Inputs!$E$10,'Alt setback'!$A$36:$A$43,0),MATCH(Inputs!D58,'Alt setback'!$B$35:$F$35,0)))","v":""}]
[null,null,null,0.96,{"$f":"IF($E$33=\"\",\"\",INDEX('Alt setback'!$B$3:$F$10,MATCH(Inputs!$E$10,'Alt setback'!$A$3:$A$10,0),MATCH(Inputs!D59,'Alt setback'!$B$2:$F$2,0)))","v":""},{"$f":"IF($E$33=\"\",\"\",INDEX('Alt setback'!$B$14:$F$21,MATCH(Inputs!$E$10,'Alt setback'!$A$14:$A$21,0),MATCH(Inputs!D59,'Alt setback'!$B$13:$F$13,0)))","v":""},{"$f":"IF($E$33=\"\",\"\",INDEX('Alt setback'!$B$25:$F$32,MATCH(Inputs!$E$10,'Alt setback'!$A$25:$A$32,0),MATCH(Inputs!D59,'Alt setback'!$B$24:$F$24,0)))","v":""},{"$f":"IF($E$33=\"\",\"\",INDEX('Alt setback'!$B$36:$F$43,MATCH(Inputs!$E$10,'Alt setback'!$A$36:$A$43,0),MATCH(Inputs!D59,'Alt setback'!$B$35:$F$35,0)))","v":""}]
[null,null,null,0.98,{"$f":"IF($E$33=\"\",\"\",INDEX('Alt setback'!$B$3:$F$10,MATCH(Inputs!$E$10,'Alt setback'!$A$3:$A$10,0),MATCH(Inputs!D60,'Alt setback'!$B$2:$F$2,0)))","v":""},{"$f":"IF($E$33=\"\",\"\",INDEX('Alt setback'!$B$14:$F$21,MATCH(Inputs!$E$10,'Alt setback'!$A$14:$A$21,0),MATCH(Inputs!D60,'Alt setback'!$B$13:$F$13,0)))","v":""},{"$f":"IF($E$33=\"\",\"\",INDEX('Alt setback'!$B$25:$F$32,MATCH(Inputs!$E$10,'Alt setback'!$A$25:$A$32,0),MATCH(Inputs!D60,'Alt setback'!$B$24:$F$24,0)))","v":""},{"$f":"IF($E$33=\"\",\"\",INDEX('Alt setback'!$B$36:$F$43,MATCH(Inputs!$E$10,'Alt setback'!$A$36:$A$43,0),MATCH(Inputs!D60,'Alt setback'!$B$35:$F$35,0)))","v":""}]
[null,null,null,0.99,{"$f":"IF($E$33=\"\",\"\",INDEX('Alt setback'!$B$3:$F$10,MATCH(Inputs!$E$10,'Alt setback'!$A$3:$A$10,0),MATCH(Inputs!D61,'Alt setback'!$B$2:$F$2,0)))","v":""},{"$f":"IF($E$33=\"\",\"\",INDEX('Alt setback'!$B$14:$F$21,MATCH(Inputs!$E$10,'Alt setback'!$A$14:$A$21,0),MATCH(Inputs!D61,'Alt setback'!$B$13:$F$13,0)))","v":""},{"$f":"IF($E$33=\"\",\"\",INDEX('Alt setback'!$B$25:$F$32,MATCH(Inputs!$E$10,'Alt setback'!$A$25:$A$32,0),MATCH(Inputs!D61,'Alt setback'!$B$24:$F$24,0)))","v":""},{"$f":"IF($E$33=\"\",\"\",INDEX('Alt setback'!$B$36:$F$43,MATCH(Inputs!$E$10,'Alt setback'!$A$36:$A$43,0),MATCH(Inputs!D61,'Alt setback'!$B$35:$F$35,0)))","v":""}]
[]
[]
[]
[]
[]
[]
[]
[]
[null,null,null,null,null,null,null,null,null,null,null,null,null,null,null,null,null,null,null,null,null,{"$f":"IF($U47=1,$X$7:$X$8,IF($U47=2,$X$5,IF($U47=3,$X$6,IF($U47=4,$X$9:$X$14,IF($U47=5,$X$20:$X$22,IF($U47=6,$X$23,\"\"))))))","v":""}]
[null,null,null,null,null,null,null,null,null,null,null,null,null,null,null,null,null,null,null,null,null,{"$f":"IF($V47=1,$X$7:$X$8,IF($V47=2,$X$5,IF($V47=3,$X$6,IF($V47=4,$X$9:$X$14,IF($V47=5,$X$20:$X$22,IF($V47=6,$X$23,\"\"))))))","v":""}]
[null,null,null,null,null,null,null,null,null,null,null,null,null,null,null,null,null,null,null,null,null,{"$f":"IF($W47=1,$X$7:$X$8,IF($W47=2,$X$5,IF($W47=3,$X$6,IF($W47=4,$X$9:$X$14,IF($W47=5,$X$20:$X$22,IF($W47=6,$X$23,\"\"))))))","v":""}]
[null,null,null,null,null,null,null,null,null,null,null,null,null,null,null,null,null,null,null,null,null,{"$f":"IF($X45=1,$X$7:$X$8,IF($X45=2,$X$5,IF($X45=3,$X$6,IF($X45=4,$X$9:$X$14,IF($X45=5,$X$20:$X$22,IF($X45=6,$X$23,\"\"))))))","v":""}]
[null,null,null,null,null,null,null,null,null,null,null,null,null,null,null,null,null,null,null,null,null,{"$f":"IF($Y45=1,$X$7:$X$8,IF($Y45=2,$X$5,IF($Y45=3,$X$6,IF($Y45=4,$X$9:$X$14,IF($Y45=5,$X$20:$X$22,IF($Y45=6,$X$23,\"\"))))))","v":""}]

{"sheet":"Results","index":1,"n_rows":42,"n_cols":8,"rows_kept":42,"cut":false,"hidden":false,"merged":[[22,4,22,7],[2,2,2,9],[1,2,1,8],[8,4,8,5]]}
[]
[null,null,{"$f":"Inputs!B3","v":"NEBRASKA ODOR FOOTPRINT TOOL"}]
[null,null,"Separation Distance Results"]
[]
[null,null,{"$f":"Inputs!C6","v":"Project title:"},{"$f":"IF(Inputs!D6=\"\",\"\",Inputs!D6)","v":""},null,null,{"$f":"Inputs!G6","v":"Prepared for:"},{"$f":"IF(Inputs!H6=\"\",\"\",Inputs!H6)","v":""}]
[]
[null,null,{"$f":"Inputs!C8","v":"Site location:"},{"$f":"IF(Inputs!D8=\"\",\"\",Inputs!D8)","v":""},null,null,{"$f":"Inputs!G8","v":"Prepared by:"},{"$f":"IF(Inputs!H8=\"\",\"\",Inputs!H8)","v":""}]
[]
[null,null,{"$f":"Inputs!C10","v":"Location for weather data:"},null,{"$f":"Inputs!E10","v":"Ainsworth, Neb. (North-central Neb.)"},null,{"$f":"Inputs!G10","v":"Date prepared:"},{"$f":"IF(Inputs!H10=\"\",\"\",Inputs!H10)","v":""}]
[]
[null,null,null,null,{"$f":"Inputs!E12","v":"Source Facility 1"},{"$f":"Inputs!F12","v":"Source Facility 2 "},{"$f":"Inputs!G12","v":"Source Facility 3"},{"$f":"Inputs!H12","v":"Source Facility 4"}]
[null,null,"Type of facility:",null,{"$f":"IF(Inputs!E13=\"\",\"\",Inputs!E13)","v":""},{"$f":"IF(Inputs!F13=\"\",\"\",Inputs!F13)","v":""},{"$f":"IF(Inputs!G13=\"\",\"\",Inputs!G13)","v":""},{"$f":"IF(Inputs!H13=\"\",\"\",Inputs!H13)","v":""}]
[null,null,null,null,{"$f":"IF(Inputs!E15=\"\",\"\",Inputs!E15)","v":""},{"$f":"IF(Inputs!F15=\"\",\"\",Inputs!F15)","v":""},{"$f":"IF(Inputs!G15=\"\",\"\",Inputs!G15)","v":""},{"$f":"IF(Inputs!H15=\"\",\"\",Inputs!H15)","v":""}]
[null,null,null,null,{"$f":"Inputs!E18","v":""},{"$f":"Inputs!F18","v":""},{"$f":"Inputs!G18","v":""},{"$f":"Inputs!H18","v":""}]
[null,null,{"$f":"Inputs!C28","v":"Total plan area:"},{"$f":"Inputs!D28","v":"(sq. ft.)"},{"$f":"Inputs!E28","v":""},{"$f":"Inputs!F28","v":""},{"$f":"Inputs!G28","v":""},{"$f":"Inputs!H28","v":""}]
[null,null,"Total number of animals:",null,{"$f":"IF(Inputs!E19=\"\",\"\",Inputs!E19*Inputs!E17)","v":""},{"$f":"IF(Inputs!F19=\"\",\"\",Inputs!F19*Inputs!F17)","v":""},{"$f":"IF(Inputs!G19=\"\",\"\",Inputs!G19*Inputs!G17)","v":""},{"$f":"IF(Inputs!H19=\"\",\"\",Inputs!H19*Inputs!H17)","v":""}]
[]
[null,null,"Base odor control:",null,{"$f":"IF(Inputs!E26=\"\",\"\",Inputs!E26)","v":""},{"$f":"IF(Inputs!F26=\"\",\"\",Inputs!F26)","v":""},{"$f":"IF(Inputs!G26=\"\",\"\",Inputs!G26)","v":""},{"$f":"IF(Inputs!H26=\"\",\"\",Inputs!H26)","v":""}]
[null,null,{"$f":"Inputs!C32","v":"Percentage of total odor:"},null,{"$f":"Inputs!E32","v":""},{"$f":"Inputs!F32","v":""},{"$f":"Inputs!G32","v":""},{"$f":"Inputs!H32","v":""}]
[null,null,"Alternate odor control:",null,{"$f":"IF(Inputs!E36=\"\",\"\",Inputs!E36)","v":""},{"$f":"IF(Inputs!F36=\"\",\"\",Inputs!F36)","v":""},{"$f":"IF(Inputs!G36=\"\",\"\",Inputs!G36)","v":""},{"$f":"IF(Inputs!H36=\"\",\"\",Inputs!H36)","v":""}]
[null,null,{"$f":"Inputs!C40","v":"New Percentage of total odor:"},null,{"$f":"Inputs!E40","v":""},{"$f":"Inputs!F40","v":""},{"$f":"Inputs!G40","v":""},{"$f":"Inputs!H40","v":""}]
[]
[null,null,null,null,{"$f":"Inputs!E49","v":"Separation Distance (miles)"}]
[null,null,null,null,{"$f":"Inputs!E50","v":"Northeast"},{"$f":"Inputs!F50","v":"Southeast"},{"$f":"Inputs!G50","v":"Southwest"},{"$f":"Inputs!H50","v":"Northwest"}]
[null,null,{"$f":"Inputs!C51","v":"BASE PLAN"},{"$f":"Inputs!D51","v":0.9},{"$f":"Inputs!E51","v":""},{"$f":"Inputs!F51","v":""},{"$f":"Inputs!G51","v":""},{"$f":"Inputs!H51","v":""}]
[null,null,null,{"$f":"Inputs!D52","v":0.94},{"$f":"Inputs!E52","v":""},{"$f":"Inputs!F52","v":""},{"$f":"Inputs!G52","v":""},{"$f":"Inputs!H52","v":""}]
[null,null,"Odor Annoyance-Free",{"$f":"Inputs!D53","v":0.96},{"$f":"Inputs!E53","v":""},{"$f":"Inputs!F53","v":""},{"$f":"Inputs!G53","v":""},{"$f":"Inputs!H53","v":""}]
[null,null,"Frequency",{"$f":"Inputs!D54","v":0.98},{"$f":"Inputs!E54","v":""},{"$f":"Inputs!F54","v":""},{"$f":"Inputs!G54","v":""},{"$f":"Inputs!H54","v":""}]
[null,null,null,{"$f":"Inputs!D55","v":0.99},{"$f":"Inputs!E55","v":""},{"$f":"Inputs!F55","v":""},{"$f":"Inputs!G55","v":""},{"$f":"Inputs!H55","v":""}]
[]
[null,null,{"$f":"Inputs!C57","v":"ALTERNATE PLAN"},{"$f":"Inputs!D57","v":0.9},{"$f":"Inputs!E57","v":""},{"$f":"Inputs!F57","v":""},{"$f":"Inputs!G57","v":""},{"$f":"Inputs!H57","v":""}]
[null,null,null,{"$f":"Inputs!D58","v":0.94},{"$f":"Inputs!E58","v":""},{"$f":"Inputs!F58","v":""},{"$f":"Inputs!G58","v":""},{"$f":"Inputs!H58","v":""}]
[null,null,"Odor Annoyance-Free",{"$f":"Inputs!D59","v":0.96},{"$f":"Inputs!E59","v":""},{"$f":"Inputs!F59","v":""},{"$f":"Inputs!G59","v":""},{"$f":"Inputs!H59","v":""}]
[null,null,"Frequency",{"$f":"Inputs!D60","v":0.98},{"$f":"Inputs!E60","v":""},{"$f":"Inputs!F60","v":""},{"$f":"Inputs!G60","v":""},{"$f":"Inputs!H60","v":""}]
[null,null,null,{"$f":"Inputs!D61","v":0.99},{"$f":"Inputs!E61","v":""},{"$f":"Inputs!F61","v":""},{"$f":"Inputs!G61","v":""},{"$f":"Inputs!H61","v":""}]
[]
[null,null,null,null,{"$f":"Inputs!E44","v":"Northeast"},{"$f":"Inputs!F44","v":"Southeast"},{"$f":"Inputs!G44","v":"Southwest"},{"$f":"Inputs!H44","v":"Northwest"}]
[null,null,"Terrain: (apply on receptor-by-receptor basis)",null,{"$f":"Inputs!E45","v":"Flat terrain"},{"$f":"Inputs!F45","v":"Flat terrain"},{"$f":"Inputs!G45","v":"Flat terrain"},{"$f":"Inputs!H45","v":"Flat terrain"}]
[]
[]
[null,null,null,null," Funding provided by: The Nebraska Environmental Trust"]
[null,null,null,null,null,"Pork Checkoff"]

{"sheet":"Graphs","index":2,"n_rows":52,"n_cols":8,"rows_kept":52,"cut":false,"hidden":false,"merged":[[1,1,1,8],[2,1,2,8],[6,3,6,4]]}
[]
[null,{"$f":"Inputs!B3","v":"NEBRASKA ODOR FOOTPRINT TOOL"}]
[null,"Separation Distance Graphs"]
[]
[null,null,{"$f":"Inputs!C6","v":"Project title:"},{"$f":"IF(Inputs!D6=\"\",\"\",Inputs!D6)","v":""},null,null,{"$f":"Inputs!G6","v":"Prepared for:"},{"$f":"IF(Inputs!H6=\"\",\"\",Inputs!H6)","v":""}]
[null,null,{"$f":"Inputs!C8","v":"Site location:"},{"$f":"IF(Inputs!D8=\"\",\"\",Inputs!D8)","v":""},null,null,{"$f":"Inputs!G8","v":"Prepared by:"},{"$f":"IF(Inputs!H8=\"\",\"\",Inputs!H8)","v":""}]
[null,null,"Notes:",{"$f":"IF(OR(Inputs!E18=Inputs!AH7,Inputs!F18=Inputs!AH7,Inputs!G18=Inputs!AH7,Inputs!H18=Inputs!AH7),\"Results do not account for all of the selected odor sources\",\"\")","v":""},null,null,{"$f":"Inputs!G10","v":"Date prepared:"},{"$f":"IF(Inputs!H10=\"\",\"\",Inputs!H10)","v":""}]
[]
[null,null,null,null,"Base Plan Separation Distances:",null,null,"Alternate Odor Control Plan Separation Distances:"]
[null,null,null,null,"Graph radius: 1 mile"]
[null,null,"Select annoyance-free frequency:"]
[]
[]
[]
[]
[]
[]
[]
[]
[]
[]
[]
[]
[]
[]
[]
[]
[null,null,"Larger scale graphs below"]
[]
[null,null,null,null,"Graph radius: 3 miles"]
[]
[]
[]
[null,null,"Funding provided by:"]
[null,null,"The Nebraska Environmental"]
[null,null,"      Trust"]
[null,null,"Prok Checkoff"]
[]
[]
[]
[]
[]
[]
[]
[]
[]
[]
[]
[]
[]
[]
[null,null,null,null,"Graph radius: 5 miles"]

{"sheet":"Calculations","index":3,"n_rows":30,"n_cols":8,"rows_kept":30,"cut":false,"hidden":false,"merged":[[27,2,27,3],[29,2,29,3],[6,4,6,5],[13,2,14,2],[17,2,17,3],[1,1,1,8],[2,1,2,8],[4,3,4,5],[5,3,5,5],[26,2,26,3],[23,6,23,7]]}
[]
[null,{"$f":"Inputs!B3","v":"NEBRASKA ODOR FOOTPRINT TOOL"}]
[null,"Values Used in the Calculation of Separation Distances"]
[]
[null,null,{"$f":"Inputs!C6","v":"Project title:"},{"$f":"Inputs!D6","v":0},null,null,{"$f":"Inputs!G6","v":"Prepared for:"},{"$f":"Inputs!H6","v":0}]
[null,null,{"$f":"Inputs!C8","v":"Site location:"},{"$f":"Inputs!D8","v":0},null,null,{"$f":"Inputs!G8","v":"Prepared by:"},{"$f":"Inputs!H8","v":0}]
[null,null,{"$f":"Inputs!C10","v":"Location for weather data:"},null,{"$f":"Inputs!E10","v":"Ainsworth, Neb. (North-central Neb.)"},null,{"$f":"Inputs!G10","v":"Date prepared:"},{"$f":"Inputs!H10","v":"00:00:00"}]
[]
[null,null,{"$f":"Inputs!C12","v":"BASE PLAN"},null,{"$f":"Inputs!E12","v":"Source Facility 1"},{"$f":"Inputs!F12","v":"Source Facility 2 "},{"$f":"Inputs!G12","v":"Source Facility 3"},{"$f":"Inputs!H12","v":"Source Facility 4"}]
[null,null,{"$f":"Inputs!C13","v":"Select odor sources:"},null,{"$f":"Inputs!E13","v":0},{"$f":"Inputs!F13","v":0},{"$f":"Inputs!G13","v":0},{"$f":"Inputs!H13","v":0}]
[null,null,{"$f":"Inputs!C15","v":"Select type of facility:"},null,{"$f":"Inputs!E15","v":0},{"$f":"Inputs!F15","v":0},{"$f":"Inputs!G15","v":0},{"$f":"Inputs!H15","v":0}]
[null,null,{"$f":"Inputs!C19","v":"Number of animals per facility:"},null,{"$f":"Inputs!E19","v":0},{"$f":"Inputs!F19","v":0},{"$f":"Inputs!G19","v":0},{"$f":"Inputs!H19","v":0}]
[null,null,{"$f":"Inputs!C21","v":"Facility plan dimensions:"}]
[null,null,{"$f":"Inputs!C22","v":"   a) Length & Width"},{"$f":"Inputs!D22","v":"(ft)"},{"$f":"Inputs!E22","v":0},{"$f":"Inputs!F22","v":0},{"$f":"Inputs!G22","v":0},{"$f":"Inputs!H22","v":0}]
[null,null,null,{"$f":"Inputs!D23","v":"(ft)"},{"$f":"Inputs!E23","v":0},{"$f":"Inputs!F23","v":0},{"$f":"Inputs!G23","v":0},{"$f":"Inputs!H23","v":0}]
[null,null,{"$f":"Inputs!C24","v":"OR b) Diameter:"},{"$f":"Inputs!D24","v":"(ft)"},{"$f":"Inputs!E24","v":0},{"$f":"Inputs!F24","v":0},{"$f":"Inputs!G24","v":0},{"$f":"Inputs!H24","v":0}]
[null,null,{"$f":"Inputs!C17","v":"Number of identical facilities:"},null,{"$f":"Inputs!E17","v":1},{"$f":"Inputs!F17","v":1},{"$f":"Inputs!G17","v":1},{"$f":"Inputs!H17","v":1}]
[null,null,{"$f":"Inputs!C26","v":"Select odor control used in Base Plan:"},null,{"$f":"Inputs!E26","v":0},{"$f":"Inputs!F26","v":0},{"$f":"Inputs!G26","v":0},{"$f":"Inputs!H26","v":0}]
[null,null,{"$f":"Inputs!C28","v":"Total plan area:"},{"$f":"Inputs!D28","v":"(sq. ft.)"},{"$f":"Inputs!E28","v":""},{"$f":"Inputs!F28","v":""},{"$f":"Inputs!G28","v":""},{"$f":"Inputs!H28","v":""}]
[null,null,{"$f":"Inputs!C29","v":"OFT odor emission number*:"},null,{"$f":"Inputs!E29","v":""},{"$f":"Inputs!F29","v":""},{"$f":"Inputs!G29","v":""},{"$f":"Inputs!H29","v":""}]
[null,null,{"$f":"Inputs!C30","v":"Odor control factor:"},null,{"$f":"Inputs!E30","v":""},{"$f":"Inputs!F30","v":""},{"$f":"Inputs!G30","v":""},{"$f":"Inputs!H30","v":""}]
[null,null,{"$f":"Inputs!C31","v":"Facility odor emission rate*:   "},"(106 OU/s)",{"$f":"Inputs!E31","v":""},{"$f":"Inputs!F31","v":""},{"$f":"Inputs!G31","v":""},{"$f":"Inputs!H31","v":""}]
[]
[null,null,{"$f":"Inputs!C33","v":"Total odor emission rate*:"},null,{"$f":"Inputs!E33","v":""},"x 106 OU/s",{"$f":"Inputs!G33","v":"* The emission values shown have been scaled up - based upon calibration study results - for use with the Odor Footprint Tool."}]
[]
[null,null,{"$f":"Inputs!C35","v":"ALTERNATE PLAN"},null,{"$f":"Inputs!E35","v":"Source Facilty 1"},{"$f":"Inputs!F35","v":"Source Facility 2 "},{"$f":"Inputs!G35","v":"Source Facility 3"},{"$f":"Inputs!H35","v":"Source Facility 4"}]
[null,null,{"$f":"Inputs!C36","v":"Select odor control option being considered:"},null,{"$f":"Inputs!E36","v":0},{"$f":"Inputs!F36","v":0},{"$f":"Inputs!G36","v":0},{"$f":"Inputs!H36","v":0}]
[null,null,{"$f":"Inputs!C38","v":"Odor control factor:"},null,{"$f":"Inputs!E38","v":""},{"$f":"Inputs!F38","v":""},{"$f":"Inputs!G38","v":""},{"$f":"Inputs!H38","v":""}]
[]
[null,null,{"$f":"Inputs!C42","v":"New total odor emission rate*:"},null,{"$f":"Inputs!E42","v":""},"x 106 OU/s"]

{"sheet":"graphing","index":4,"n_rows":30,"n_cols":11,"rows_kept":30,"cut":false,"hidden":true,"merged":[]}
[{"$f":"Results!C25","v":"BASE PLAN"}]
[null,"Angle",{"$f":"Results!D25","v":0.9},{"$f":"Results!D26","v":0.94},{"$f":"Results!D27","v":0.96},{"$f":"Results!D28","v":0.98},{"$f":"Results!D29","v":0.99}]
[{"$f":"Results!E24","v":"Northeast"},{"$f":"IF(A3=\"North\",360,315)","v":315},{"$f":"Results!E25","v":""},{"$f":"Results!E26","v":""},{"$f":"Results!E27","v":""},{"$f":"Results!E28","v":""},{"$f":"Results!E29","v":""}]
[{"$f":"Results!F24","v":"Southeast"},{"$f":"IF(A4=\"East\",270,225)","v":225},{"$f":"Results!F25","v":""},{"$f":"Results!F26","v":""},{"$f":"Results!F27","v":""},{"$f":"Results!F28","v":""},{"$f":"Results!F29","v":""}]
[{"$f":"Results!G24","v":"Southwest"},{"$f":"IF(A5=\"South\",180,135)","v":135},{"$f":"Results!G25","v":""},{"$f":"Results!G26","v":""},{"$f":"Results!G27","v":""},{"$f":"Results!G28","v":""},{"$f":"Results!G29","v":""}]
[{"$f":"Results!H24","v":"Northwest"},{"$f":"IF(A6=\"West\",90,45)","v":45},{"$f":"Results!H25","v":""},{"$f":"Results!H26","v":""},{"$f":"Results!H27","v":""},{"$f":"Results!H28","v":""},{"$f":"Results!H29","v":""}]
[]
[{"$f":"Results!C31","v":"ALTERNATE PLAN"}]
[null,"Angle",{"$f":"Results!D31","v":0.9},{"$f":"Results!D32","v":0.94},{"$f":"Results!D33","v":0.96},{"$f":"Results!D34","v":0.98},{"$f":"Results!D35","v":0.99}]
[{"$f":"Results!E24","v":"Northeast"},{"$f":"IF(A10=\"North\",360,315)","v":315},{"$f":"Results!E31","v":""},{"$f":"Results!E32","v":""},{"$f":"Results!E33","v":""},{"$f":"Results!E34","v":""},{"$f":"Results!E35","v":""}]
[{"$f":"Results!F24","v":"Southeast"},{"$f":"IF(A11=\"East\",270,225)","v":225},{"$f":"Results!F31","v":""},{"$f":"Results!F32","v":""},{"$f":"Results!F33","v":""},{"$f":"Results!F34","v":""},{"$f":"Results!F35","v":""}]
[{"$f":"Results!G24","v":"Southwest"},{"$f":"IF(A12=\"South\",180,135)","v":135},{"$f":"Results!G31","v":""},{"$f":"Results!G32","v":""},{"$f":"Results!G33","v":""},{"$f":"Results!G34","v":""},{"$f":"Results!G35","v":""}]
[{"$f":"Results!H24","v":"Northwest"},{"$f":"IF(A13=\"West\",90,45)","v":45},{"$f":"Results!H31","v":""},{"$f":"Results!H32","v":""},{"$f":"Results!H33","v":""},{"$f":"Results!H34","v":""},{"$f":"Results!H35","v":""}]
[]
[]
[]
[{"$f":"A1","v":"BASE PLAN"},null,0.99,null,0.98,null,0.96,null,0.94,null,0.9]
[null,null,true,null,true,null,true,null,true,null,true]
[null,"X","Y","X","Y","X","Y","X","Y","X","Y"]
[{"$f":"A3","v":"Northeast"},{"$f":"IF(C$18=TRUE,G3*COS(($B3+90)*PI()/180),10)","v":{"$error":"#VALUE!"}},{"$f":"IF(C$18=TRUE,G3*SIN(($B3+90)*PI()/180),10)","v":{"$error":"#VALUE!"}},{"$f":"IF(E$18=TRUE,F3*COS(($B3+90)*PI()/180),10)","v":{"$error":"#VALUE!"}},{"$f":"IF(E$18=TRUE,F3*SIN(($B3+90)*PI()/180),10)","v":{"$error":"#VALUE!"}},{"$f":"IF(G$18=TRUE,E3*COS(($B3+90)*PI()/180),10)","v":{"$error":"#VALUE!"}},{"$f":"IF(G$18=TRUE,E3*SIN(($B3+90)*PI()/180),10)","v":{"$error":"#VALUE!"}},{"$f":"IF(I$18=TRUE,D3*COS(($B3+90)*PI()/180),10)","v":{"$error":"#VALUE!"}},{"$f":"IF(I$18=TRUE,D3*SIN(($B3+90)*PI()/180),10)","v":{"$error":"#VALUE!"}},{"$f":"IF(K$18=TRUE,C3*COS(($B3+90)*PI()/180),10)","v":{"$error":"#VALUE!"}},{"$f":"IF(K$18=TRUE,C3*SIN(($B3+90)*PI()/180),10)","v":{"$error":"#VALUE!"}}]
[{"$f":"A4","v":"Southeast"},{"$f":"IF(C$18=TRUE,G4*COS(($B4+90)*PI()/180),10)","v":{"$error":"#VALUE!"}},{"$f":"IF(C$18=TRUE,G4*SIN(($B4+90)*PI()/180),10)","v":{"$error":"#VALUE!"}},{"$f":"IF(E$18=TRUE,F4*COS(($B4+90)*PI()/180),10)","v":{"$error":"#VALUE!"}},{"$f":"IF(E$18=TRUE,F4*SIN(($B4+90)*PI()/180),10)","v":{"$error":"#VALUE!"}},{"$f":"IF(G$18=TRUE,E4*COS(($B4+90)*PI()/180),10)","v":{"$error":"#VALUE!"}},{"$f":"IF(G$18=TRUE,E4*SIN(($B4+90)*PI()/180),10)","v":{"$error":"#VALUE!"}},{"$f":"IF(I$18=TRUE,D4*COS(($B4+90)*PI()/180),10)","v":{"$error":"#VALUE!"}},{"$f":"IF(I$18=TRUE,D4*SIN(($B4+90)*PI()/180),10)","v":{"$error":"#VALUE!"}},{"$f":"IF(K$18=TRUE,C4*COS(($B4+90)*PI()/180),10)","v":{"$error":"#VALUE!"}},{"$f":"IF(K$18=TRUE,C4*SIN(($B4+90)*PI()/180),10)","v":{"$error":"#VALUE!"}}]
[{"$f":"A5","v":"Southwest"},{"$f":"IF(C$18=TRUE,G5*COS(($B5+90)*PI()/180),10)","v":{"$error":"#VALUE!"}},{"$f":"IF(C$18=TRUE,G5*SIN(($B5+90)*PI()/180),10)","v":{"$error":"#VALUE!"}},{"$f":"IF(E$18=TRUE,F5*COS(($B5+90)*PI()/180),10)","v":{"$error":"#VALUE!"}},{"$f":"IF(E$18=TRUE,F5*SIN(($B5+90)*PI()/180),10)","v":{"$error":"#VALUE!"}},{"$f":"IF(G$18=TRUE,E5*COS(($B5+90)*PI()/180),10)","v":{"$error":"#VALUE!"}},{"$f":"IF(G$18=TRUE,E5*SIN(($B5+90)*PI()/180),10)","v":{"$error":"#VALUE!"}},{"$f":"IF(I$18=TRUE,D5*COS(($B5+90)*PI()/180),10)","v":{"$error":"#VALUE!"}},{"$f":"IF(I$18=TRUE,D5*SIN(($B5+90)*PI()/180),10)","v":{"$error":"#VALUE!"}},{"$f":"IF(K$18=TRUE,C5*COS(($B5+90)*PI()/180),10)","v":{"$error":"#VALUE!"}},{"$f":"IF(K$18=TRUE,C5*SIN(($B5+90)*PI()/180),10)","v":{"$error":"#VALUE!"}}]
[{"$f":"A6","v":"Northwest"},{"$f":"IF(C$18=TRUE,G6*COS(($B6+90)*PI()/180),10)","v":{"$error":"#VALUE!"}},{"$f":"IF(C$18=TRUE,G6*SIN(($B6+90)*PI()/180),10)","v":{"$error":"#VALUE!"}},{"$f":"IF(E$18=TRUE,F6*COS(($B6+90)*PI()/180),10)","v":{"$error":"#VALUE!"}},{"$f":"IF(E$18=TRUE,F6*SIN(($B6+90)*PI()/180),10)","v":{"$error":"#VALUE!"}},{"$f":"IF(G$18=TRUE,E6*COS(($B6+90)*PI()/180),10)","v":{"$error":"#VALUE!"}},{"$f":"IF(G$18=TRUE,E6*SIN(($B6+90)*PI()/180),10)","v":{"$error":"#VALUE!"}},{"$f":"IF(I$18=TRUE,D6*COS(($B6+90)*PI()/180),10)","v":{"$error":"#VALUE!"}},{"$f":"IF(I$18=TRUE,D6*SIN(($B6+90)*PI()/180),10)","v":{"$error":"#VALUE!"}},{"$f":"IF(K$18=TRUE,C6*COS(($B6+90)*PI()/180),10)","v":{"$error":"#VALUE!"}},{"$f":"IF(K$18=TRUE,C6*SIN(($B6+90)*PI()/180),10)","v":{"$error":"#VALUE!"}}]
[]
[{"$f":"A8","v":"ALTERNATE PLAN"}]
[null,"X","Y","X","Y","X","Y","X","Y","X","Y"]
[{"$f":"A10","v":"Northeast"},{"$f":"IF(C$18=TRUE,G10*COS(($B10+90)*PI()/180),10)","v":{"$error":"#VALUE!"}},{"$f":"IF(C$18=TRUE,G10*SIN(($B10+90)*PI()/180),10)","v":{"$error":"#VALUE!"}},{"$f":"IF(E$18=TRUE,F10*COS(($B10+90)*PI()/180),10)","v":{"$error":"#VALUE!"}},{"$f":"IF(E$18=TRUE,F10*SIN(($B10+90)*PI()/180),10)","v":{"$error":"#VALUE!"}},{"$f":"IF(G$18=TRUE,E10*COS(($B10+90)*PI()/180),10)","v":{"$error":"#VALUE!"}},{"$f":"IF(G$18=TRUE,E10*SIN(($B10+90)*PI()/180),10)","v":{"$error":"#VALUE!"}},{"$f":"IF(I$18=TRUE,D10*COS(($B10+90)*PI()/180),10)","v":{"$error":"#VALUE!"}},{"$f":"IF(I$18=TRUE,D10*SIN(($B10+90)*PI()/180),10)","v":{"$error":"#VALUE!"}},{"$f":"IF(K$18=TRUE,C10*COS(($B10+90)*PI()/180),10)","v":{"$error":"#VALUE!"}},{"$f":"IF(K$18=TRUE,C10*SIN(($B10+90)*PI()/180),10)","v":{"$error":"#VALUE!"}}]
[{"$f":"A11","v":"Southeast"},{"$f":"IF(C$18=TRUE,G11*COS(($B11+90)*PI()/180),10)","v":{"$error":"#VALUE!"}},{"$f":"IF(C$18=TRUE,G11*SIN(($B11+90)*PI()/180),10)","v":{"$error":"#VALUE!"}},{"$f":"IF(E$18=TRUE,F11*COS(($B11+90)*PI()/180),10)","v":{"$error":"#VALUE!"}},{"$f":"IF(E$18=TRUE,F11*SIN(($B11+90)*PI()/180),10)","v":{"$error":"#VALUE!"}},{"$f":"IF(G$18=TRUE,E11*COS(($B11+90)*PI()/180),10)","v":{"$error":"#VALUE!"}},{"$f":"IF(G$18=TRUE,E11*SIN(($B11+90)*PI()/180),10)","v":{"$error":"#VALUE!"}},{"$f":"IF(I$18=TRUE,D11*COS(($B11+90)*PI()/180),10)","v":{"$error":"#VALUE!"}},{"$f":"IF(I$18=TRUE,D11*SIN(($B11+90)*PI()/180),10)","v":{"$error":"#VALUE!"}},{"$f":"IF(K$18=TRUE,C11*COS(($B11+90)*PI()/180),10)","v":{"$error":"#VALUE!"}},{"$f":"IF(K$18=TRUE,C11*SIN(($B11+90)*PI()/180),10)","v":{"$error":"#VALUE!"}}]
[{"$f":"A12","v":"Southwest"},{"$f":"IF(C$18=TRUE,G12*COS(($B12+90)*PI()/180),10)","v":{"$error":"#VALUE!"}},{"$f":"IF(C$18=TRUE,G12*SIN(($B12+90)*PI()/180),10)","v":{"$error":"#VALUE!"}},{"$f":"IF(E$18=TRUE,F12*COS(($B12+90)*PI()/180),10)","v":{"$error":"#VALUE!"}},{"$f":"IF(E$18=TRUE,F12*SIN(($B12+90)*PI()/180),10)","v":{"$error":"#VALUE!"}},{"$f":"IF(G$18=TRUE,E12*COS(($B12+90)*PI()/180),10)","v":{"$error":"#VALUE!"}},{"$f":"IF(G$18=TRUE,E12*SIN(($B12+90)*PI()/180),10)","v":{"$error":"#VALUE!"}},{"$f":"IF(I$18=TRUE,D12*COS(($B12+90)*PI()/180),10)","v":{"$error":"#VALUE!"}},{"$f":"IF(I$18=TRUE,D12*SIN(($B12+90)*PI()/180),10)","v":{"$error":"#VALUE!"}},{"$f":"IF(K$18=TRUE,C12*COS(($B12+90)*PI()/180),10)","v":{"$error":"#VALUE!"}},{"$f":"IF(K$18=TRUE,C12*SIN(($B12+90)*PI()/180),10)","v":{"$error":"#VALUE!"}}]
[{"$f":"A13","v":"Northwest"},{"$f":"IF(C$18=TRUE,G13*COS(($B13+90)*PI()/180),10)","v":{"$error":"#VALUE!"}},{"$f":"IF(C$18=TRUE,G13*SIN(($B13+90)*PI()/180),10)","v":{"$error":"#VALUE!"}},{"$f":"IF(E$18=TRUE,F13*COS(($B13+90)*PI()/180),10)","v":{"$error":"#VALUE!"}},{"$f":"IF(E$18=TRUE,F13*SIN(($B13+90)*PI()/180),10)","v":{"$error":"#VALUE!"}},{"$f":"IF(G$18=TRUE,E13*COS(($B13+90)*PI()/180),10)","v":{"$error":"#VALUE!"}},{"$f":"IF(G$18=TRUE,E13*SIN(($B13+90)*PI()/180),10)","v":{"$error":"#VALUE!"}},{"$f":"IF(I$18=TRUE,D13*COS(($B13+90)*PI()/180),10)","v":{"$error":"#VALUE!"}},{"$f":"IF(I$18=TRUE,D13*SIN(($B13+90)*PI()/180),10)","v":{"$error":"#VALUE!"}},{"$f":"IF(K$18=TRUE,C13*COS(($B13+90)*PI()/180),10)","v":{"$error":"#VALUE!"}},{"$f":"IF(K$18=TRUE,C13*SIN(($B13+90)*PI()/180),10)","v":{"$error":"#VALUE!"}}]

{"sheet":"Grand Island","index":5,"n_rows":102,"n_cols":21,"rows_kept":102,"cut":false,"hidden":true,"merged":[[81,1,81,5],[81,8,81,12],[3,1,3,5],[3,8,3,12],[29,1,29,5],[29,8,29,12],[55,1,55,5],[55,8,55,12]]}
["Grand Island, NE-AERMOD setback distances (North) as reported in the Odor Footprint Tool",null,null,null,null,null,null,null,null,null,null,null,null,null,"Total Scaled Odor Emission Rate (x10^6)",{"$f":"Inputs!E33","v":""}]
[null,null,null,null,null,null,null,null,null,null,null,null,null,null,"New Total Scaled Odor Emission Rate (x10^6)",{"$f":"Inputs!E42","v":""}]
["Setback Distances (m) for Grand Island, North",null,null,null,null,null,null,"Setback Distances (mi) for Grand Island, North"]
["x 104","Annoyance Free Percentage",null,null,null,null,null,"x 106","Annoyance Free Percentage",null,null,null,null,null,"Annoyance free percentage",99,98,96,94,90]
["OU/s",99,98,96,94,90,null,"OU/s",99,98,96,94,90,null,"Separation distance",{"$f":"IF(ISERROR(MATCH($P$1,$H$6:$H$24,0)),VLOOKUP($P$1,$H$6:$M$24,MATCH(P4,$I$5:$M$5,0)+1,TRUE)+($P$1-VLOOKUP($P$1,$H$6:$H$24,1,TRUE))*(INDEX($I$6:$M$24,MATCH($P$1,$H$6:$H$24,1)+1,MATCH(P4,$I$5:$M$5,0))-INDEX($I$6:$M$24,MATCH($P$1,$H$6:$H$24,1),MATCH(P4,$I$5:$M$5,0)))/(INDEX($H$6:$H$24,MATCH($P$1,$H$6:$H$24,1)+1)-INDEX($H$6:$H$24,MATCH($P$1,$H$6:$H$24,1))),INDEX($I$6:$M$24,MATCH($P$1,$H$6:$H$24,0),MATCH(P4,$I$5:$M$5,0)))","v":{"$error":"#N/A"}},{"$f":"IF(ISERROR(MATCH($P$1,$H$6:$H$24,0)),VLOOKUP($P$1,$H$6:$M$24,MATCH(Q4,$I$5:$M$5,0)+1,TRUE)+($P$1-VLOOKUP($P$1,$H$6:$H$24,1,TRUE))*(INDEX($I$6:$M$24,MATCH($P$1,$H$6:$H$24,1)+1,MATCH(Q4,$I$5:$M$5,0))-INDEX($I$6:$M$24,MATCH($P$1,$H$6:$H$24,1),MATCH(Q4,$I$5:$M$5,0)))/(INDEX($H$6:$H$24,MATCH($P$1,$H$6:$H$24,1)+1)-INDEX($H$6:$H$24,MATCH($P$1,$H$6:$H$24,1))),INDEX($I$6:$M$24,MATCH($P$1,$H$6:$H$24,0),MATCH(Q4,$I$5:$M$5,0)))","v":{"$error":"#N/A"}},{"$f":"IF(ISERROR(MATCH($P$1,$H$6:$H$24,0)),VLOOKUP($P$1,$H$6:$M$24,MATCH(R4,$I$5:$M$5,0)+1,TRUE)+($P$1-VLOOKUP($P$1,$H$6:$H$24,1,TRUE))*(INDEX($I$6:$M$24,MATCH($P$1,$H$6:$H$24,1)+1,MATCH(R4,$I$5:$M$5,0))-INDEX($I$6:$M$24,MATCH($P$1,$H$6:$H$24,1),MATCH(R4,$I$5:$M$5,0)))/(INDEX($H$6:$H$24,MATCH($P$1,$H$6:$H$24,1)+1)-INDEX($H$6:$H$24,MATCH($P$1,$H$6:$H$24,1))),INDEX($I$6:$M$24,MATCH($P$1,$H$6:$H$24,0),MATCH(R4,$I$5:$M$5,0)))","v":{"$error":"#N/A"}},{"$f":"IF(ISERROR(MATCH($P$1,$H$6:$H$24,0)),VLOOKUP($P$1,$H$6:$M$24,MATCH(S4,$I$5:$M$5,0)+1,TRUE)+($P$1-VLOOKUP($P$1,$H$6:$H$24,1,TRUE))*(INDEX($I$6:$M$24,MATCH($P$1,$H$6:$H$24,1)+1,MATCH(S4,$I$5:$M$5,0))-INDEX($I$6:$M$24,MATCH($P$1,$H$6:$H$24,1),MATCH(S4,$I$5:$M$5,0)))/(INDEX($H$6:$H$24,MATCH($P$1,$H$6:$H$24,1)+1)-INDEX($H$6:$H$24,MATCH($P$1,$H$6:$H$24,1))),INDEX($I$6:$M$24,MATCH($P$1,$H$6:$H$24,0),MATCH(S4,$I$5:$M$5,0)))","v":{"$error":"#N/A"}},{"$f":"IF(ISERROR(MATCH($P$1,$H$6:$H$24,0)),VLOOKUP($P$1,$H$6:$M$24,MATCH(T4,$I$5:$M$5,0)+1,TRUE)+($P$1-VLOOKUP($P$1,$H$6:$H$24,1,TRUE))*(INDEX($I$6:$M$24,MATCH($P$1,$H$6:$H$24,1)+1,MATCH(T4,$I$5:$M$5,0))-INDEX($I$6:$M$24,MATCH($P$1,$H$6:$H$24,1),MATCH(T4,$I$5:$M$5,0)))/(INDEX($H$6:$H$24,MATCH($P$1,$H$6:$H$24,1)+1)-INDEX($H$6:$H$24,MATCH($P$1,$H$6:$H$24,1))),INDEX($I$6:$M$24,MATCH($P$1,$H$6:$H$24,0),MATCH(T4,$I$5:$M$5,0)))","v":{"$error":"#N/A"}},"IF(ISERROR(MATCH($N$2,H6:H24,0)),VLOOKUP($N$2,H6:M24,MATCH($N$1,I5:M5,0)+1,TRUE)+($N$2-VLOOKUP($N$2,H6:H24,1,TRUE))*(INDEX(I6:M24,MATCH($N$2,H6:H24,1)+1,MATCH($N$1,I5:M5,0))-INDEX(I6:M24,MATCH($N$2,H6:H24,1),MATCH($N$1,I5:M5,0)))/(INDEX(H6:H24,MATCH($N$2,H6:H24,1)+1)-INDEX(H6:H24,MATCH($N$2,H6:H24,1))),INDEX(I6:M24,MATCH($N$2,H6:H24,0),MATCH(Sheet1!$C$28,Sheet2!I5:M5,0)))"]
[0,0,0,0,0,0,null,{"$f":"A6/100","v":0},0,0,0,0,0,null,"New Separation distance",{"$f":"IF(ISERROR(MATCH($P$2,$H$6:$H$24,0)),VLOOKUP($P$2,$H$6:$M$24,MATCH(P4,$I$5:$M$5,0)+1,TRUE)+($P$2-VLOOKUP($P$2,$H$6:$H$24,1,TRUE))*(INDEX($I$6:$M$24,MATCH($P$2,$H$6:$H$24,1)+1,MATCH(P4,$I$5:$M$5,0))-INDEX($I$6:$M$24,MATCH($P$2,$H$6:$H$24,1),MATCH(P4,$I$5:$M$5,0)))/(INDEX($H$6:$H$24,MATCH($P$2,$H$6:$H$24,1)+1)-INDEX($H$6:$H$24,MATCH($P$2,$H$6:$H$24,1))),INDEX($I$6:$M$24,MATCH($P$2,$H$6:$H$24,0),MATCH(P4,$I$5:$M$5,0)))","v":{"$error":"#N/A"}},{"$f":"IF(ISERROR(MATCH($P$2,$H$6:$H$24,0)),VLOOKUP($P$2,$H$6:$M$24,MATCH(Q4,$I$5:$M$5,0)+1,TRUE)+($P$2-VLOOKUP($P$2,$H$6:$H$24,1,TRUE))*(INDEX($I$6:$M$24,MATCH($P$2,$H$6:$H$24,1)+1,MATCH(Q4,$I$5:$M$5,0))-INDEX($I$6:$M$24,MATCH($P$2,$H$6:$H$24,1),MATCH(Q4,$I$5:$M$5,0)))/(INDEX($H$6:$H$24,MATCH($P$2,$H$6:$H$24,1)+1)-INDEX($H$6:$H$24,MATCH($P$2,$H$6:$H$24,1))),INDEX($I$6:$M$24,MATCH($P$2,$H$6:$H$24,0),MATCH(Q4,$I$5:$M$5,0)))","v":{"$error":"#N/A"}},{"$f":"IF(ISERROR(MATCH($P$2,$H$6:$H$24,0)),VLOOKUP($P$2,$H$6:$M$24,MATCH(R4,$I$5:$M$5,0)+1,TRUE)+($P$2-VLOOKUP($P$2,$H$6:$H$24,1,TRUE))*(INDEX($I$6:$M$24,MATCH($P$2,$H$6:$H$24,1)+1,MATCH(R4,$I$5:$M$5,0))-INDEX($I$6:$M$24,MATCH($P$2,$H$6:$H$24,1),MATCH(R4,$I$5:$M$5,0)))/(INDEX($H$6:$H$24,MATCH($P$2,$H$6:$H$24,1)+1)-INDEX($H$6:$H$24,MATCH($P$2,$H$6:$H$24,1))),INDEX($I$6:$M$24,MATCH($P$2,$H$6:$H$24,0),MATCH(R4,$I$5:$M$5,0)))","v":{"$error":"#N/A"}},{"$f":"IF(ISERROR(MATCH($P$2,$H$6:$H$24,0)),VLOOKUP($P$2,$H$6:$M$24,MATCH(S4,$I$5:$M$5,0)+1,TRUE)+($P$2-VLOOKUP($P$2,$H$6:$H$24,1,TRUE))*(INDEX($I$6:$M$24,MATCH($P$2,$H$6:$H$24,1)+1,MATCH(S4,$I$5:$M$5,0))-INDEX($I$6:$M$24,MATCH($P$2,$H$6:$H$24,1),MATCH(S4,$I$5:$M$5,0)))/(INDEX($H$6:$H$24,MATCH($P$2,$H$6:$H$24,1)+1)-INDEX($H$6:$H$24,MATCH($P$2,$H$6:$H$24,1))),INDEX($I$6:$M$24,MATCH($P$2,$H$6:$H$24,0),MATCH(S4,$I$5:$M$5,0)))","v":{"$error":"#N/A"}},{"$f":"IF(ISERROR(MATCH($P$2,$H$6:$H$24,0)),VLOOKUP($P$2,$H$6:$M$24,MATCH(T4,$I$5:$M$5,0)+1,TRUE)+($P$2-VLOOKUP($P$2,$H$6:$H$24,1,TRUE))*(INDEX($I$6:$M$24,MATCH($P$2,$H$6:$H$24,1)+1,MATCH(T4,$I$5:$M$5,0))-INDEX($I$6:$M$24,MATCH($P$2,$H$6:$H$24,1),MATCH(T4,$I$5:$M$5,0)))/(INDEX($H$6:$H$24,MATCH($P$2,$H$6:$H$24,1)+1)-INDEX($H$6:$H$24,MATCH($P$2,$H$6:$H$24,1))),INDEX($I$6:$M$24,MATCH($P$2,$H$6:$H$24,0),MATCH(T4,$I$5:$M$5,0)))","v":{"$error":"#N/A"}},"IF(ISERROR(MATCH($N$3,H6:H24,0)),VLOOKUP($N$3,H6:M24,MATCH($N$1,I5:M5,0)+1,TRUE)+($N$3-VLOOKUP($N$3,H6:H24,1,TRUE))*(INDEX(I6:M24,MATCH($N$3,H6:H24,1)+1,MATCH($N$1,I5:M5,0))-INDEX(I6:M24,MATCH($N$3,H6:H24,1),MATCH($N$1,I5:M5,0)))/(INDEX(H6:H24,MATCH($N$3,H6:H24,1)+1)-INDEX(H6:H24,MATCH($N$3,H6:H24,1))),INDEX(I6:M24,MATCH($N$3,H6:H24),MATCH(Sheet1!$C$28,Sheet2!I5:M5)))"]
[20,220,155,120,100,85,null,{"$f":"A7/100","v":0.2},{"$f":"+B7/1609.347","v":0.13670140746526385},{"$f":"+C7/1609.347","v":9.6312355259617718E-2},7.4564404071962104E-2,6.2137003393301755E-2,5.2816452884306496E-2]
[50,375,260,195,165,135,null,0.5,0.23301376272488158,0.16155620882258456,0.12116715661693843,0.1025260555989479,8.3884954580957377E-2]
[100,560,385,285,240,190,null,1,0.34796721900248984,0.23922746306421175,0.17709045967091,0.14912880814392421,0.11806030644727333]
[200,845,580,420,355,280,null,2,0.52505767867339981,0.36039461968115016,0.26097541425186738,0.22058636204622123,0.17398360950124492]
[300,1075,730,530,440,345,null,3,0.66797278647799385,0.45360012477110284,0.32932611798449929,0.2734028149305277,0.21437266170689107]
[400,1265,870,620,510,405,null,4,0.78603309292526724,0.5405919295217253,0.38524942103847087,0.31689871730583896,0.2516548637428721]
[500,1455,985,705,585,455,null,5,0.90409339937254052,0.61204948342402232,0.4380658739227774,0.36350146985081527,0.28272336543952298]
[600,1650,1110,775,640,495,null,6,1.025260555989479,0.68972073766564945,0.48156177629808861,0.39767682171713126,0.30757816679684369]
[700,1800,1205,850,700,540,null,7,1.1184660610794317,0.74875089088928615,0.52816452884306497,0.43495902375311229,0.33553981832382951]
[800,1965,1315,920,745,580,null,8,1.2209921166783795,0.81710159462191811,0.57166043121837617,0.46292067528009806,0.36039461968115016]
[900,2110,1390,985,800,615,null,9,1.311090771598667,0.86370434716689437,0.61204948342402232,0.49709602714641404,0.38214257086880582]
[1000,2260,1485,1040,845,660,null,10,1.4042962766886198,0.92273450039053106,0.64622483529033825,0.52505767867339981,0.41010422239579158]
[1500,2855,1910,1305,1050,805,null,15,1.7740114468787651,1.1868167648120636,0.8108878942825879,0.65243853562966847,0.50020287731607915]
[2000,3425,2245,1540,1225,925,null,20,2.1281923662205853,1.3949757261796245,0.95690985225684699,0.76117829156794647,0.57476728138804123]
[2500,3940,2605,1740,1385,1040,null,25,2.4481979336960893,1.6186689383955108,1.0811838590434506,0.86059749699722932,0.64622483529033825]
[3000,4415,2900,1910,1515,1150,null,30,2.7433486998142724,1.8019730984057509,1.1868167648120636,0.94137560140852161,0.71457553902297022]
[3500,4870,3195,2100,1640,1230,null,35,{"$f":"+B23/1609.347","v":3.0260720652537954},1.985277258415991,1.3048770712593369,1.0190468556501489,0.76428514173761164]
[4000,5250,3460,2240,1760,1315,null,{"$f":"A24/100","v":40},3.2621926781483421,2.1499403174082405,1.3918688760099593,1.0936112597221108,0.81710159462191811]
[]
[]
["Grand Island, NE-AERMOD setback distances (East) as reported in the Odor Footprint Tool"]
[]
["Setback Distances (m) for Grand Island, East",null,null,null,null,null,null,"Setback Distances (mi) for Grand Island, East"]
["x 104","Annoyance Free Percentage",null,null,null,null,null,"x 106","Annoyance Free Percentage"]
["OU/s",99,98,96,94,90,null,"OU/s",99,98,96,94,90,null,"Separation distance",{"$f":"IF(ISERROR(MATCH($P$1,$H$32:$H$50,0)),VLOOKUP($P$1,$H$32:$M$50,MATCH(P$4,$I$31:$M$31,0)+1,TRUE)+($P$1-VLOOKUP($P$1,$H$32:$H$50,1,TRUE))*(INDEX($I$32:$M$50,MATCH($P$1,$H$32:$H$50,1)+1,MATCH(P$4,$I$31:$M$31,0))-INDEX($I$32:$M$50,MATCH($P$1,$H$32:$H$50,1),MATCH(P$4,$I$31:$M$31,0)))/(INDEX($H$32:$H$50,MATCH($P$1,$H$32:$H$50,1)+1)-INDEX($H$32:$H$50,MATCH($P$1,$H$32:$H$50,1))),INDEX($I$32:$M$50,MATCH($P$1,$H$32:$H$50,0),MATCH(P4,$I$31:$M$31,0)))","v":{"$error":"#N/A"}},{"$f":"IF(ISERROR(MATCH($P$1,$H$32:$H$50,0)),VLOOKUP($P$1,$H$32:$M$50,MATCH(Q$4,$I$31:$M$31,0)+1,TRUE)+($P$1-VLOOKUP($P$1,$H$32:$H$50,1,TRUE))*(INDEX($I$32:$M$50,MATCH($P$1,$H$32:$H$50,1)+1,MATCH(Q$4,$I$31:$M$31,0))-INDEX($I$32:$M$50,MATCH($P$1,$H$32:$H$50,1),MATCH(Q$4,$I$31:$M$31,0)))/(INDEX($H$32:$H$50,MATCH($P$1,$H$32:$H$50,1)+1)-INDEX($H$32:$H$50,MATCH($P$1,$H$32:$H$50,1))),INDEX($I$32:$M$50,MATCH($P$1,$H$32:$H$50,0),MATCH(Q4,$I$31:$M$31,0)))","v":{"$error":"#N/A"}},{"$f":"IF(ISERROR(MATCH($P$1,$H$32:$H$50,0)),VLOOKUP($P$1,$H$32:$M$50,MATCH(R$4,$I$31:$M$31,0)+1,TRUE)+($P$1-VLOOKUP($P$1,$H$32:$H$50,1,TRUE))*(INDEX($I$32:$M$50,MATCH($P$1,$H$32:$H$50,1)+1,MATCH(R$4,$I$31:$M$31,0))-INDEX($I$32:$M$50,MATCH($P$1,$H$32:$H$50,1),MATCH(R$4,$I$31:$M$31,0)))/(INDEX($H$32:$H$50,MATCH($P$1,$H$32:$H$50,1)+1)-INDEX($H$32:$H$50,MATCH($P$1,$H$32:$H$50,1))),INDEX($I$32:$M$50,MATCH($P$1,$H$32:$H$50,0),MATCH(R4,$I$31:$M$31,0)))","v":{"$error":"#N/A"}},{"$f":"IF(ISERROR(MATCH($P$1,$H$32:$H$50,0)),VLOOKUP($P$1,$H$32:$M$50,MATCH(S$4,$I$31:$M$31,0)+1,TRUE)+($P$1-VLOOKUP($P$1,$H$32:$H$50,1,TRUE))*(INDEX($I$32:$M$50,MATCH($P$1,$H$32:$H$50,1)+1,MATCH(S$4,$I$31:$M$31,0))-INDEX($I$32:$M$50,MATCH($P$1,$H$32:$H$50,1),MATCH(S$4,$I$31:$M$31,0)))/(INDEX($H$32:$H$50,MATCH($P$1,$H$32:$H$50,1)+1)-INDEX($H$32:$H$50,MATCH($P$1,$H$32:$H$50,1))),INDEX($I$32:$M$50,MATCH($P$1,$H$32:$H$50,0),MATCH(S4,$I$31:$M$31,0)))","v":{"$error":"#N/A"}},{"$f":"IF(ISERROR(MATCH($P$1,$H$32:$H$50,0)),VLOOKUP($P$1,$H$32:$M$50,MATCH(T$4,$I$31:$M$31,0)+1,TRUE)+($P$1-VLOOKUP($P$1,$H$32:$H$50,1,TRUE))*(INDEX($I$32:$M$50,MATCH($P$1,$H$32:$H$50,1)+1,MATCH(T$4,$I$31:$M$31,0))-INDEX($I$32:$M$50,MATCH($P$1,$H$32:$H$50,1),MATCH(T$4,$I$31:$M$31,0)))/(INDEX($H$32:$H$50,MATCH($P$1,$H$32:$H$50,1)+1)-INDEX($H$32:$H$50,MATCH($P$1,$H$32:$H$50,1))),INDEX($I$32:$M$50,MATCH($P$1,$H$32:$H$50,0),MATCH(T4,$I$31:$M$31,0)))","v":{"$error":"#N/A"}}]
[0,0,0,0,0,0,null,{"$f":"A32/100","v":0},0,0,0,0,0,null,"New Separation distance",{"$f":"IF(ISERROR(MATCH($P$2,$H$32:$H$50,0)),VLOOKUP($P$2,$H$32:$M$50,MATCH(P$4,$I$31:$M$31,0)+1,TRUE)+($P$2-VLOOKUP($P$2,$H$32:$H$50,1,TRUE))*(INDEX($I$32:$M$50,MATCH($P$2,$H$32:$H$50,1)+1,MATCH(P$4,$I$31:$M$31,0))-INDEX($I$32:$M$50,MATCH($P$2,$H$32:$H$50,1),MATCH(P$4,$I$31:$M$31,0)))/(INDEX($H$32:$H$50,MATCH($P$2,$H$32:$H$50,1)+1)-INDEX($H$32:$H$50,MATCH($P$2,$H$32:$H$50,1))),INDEX($I$32:$M$50,MATCH($P$2,$H$32:$H$50,0),MATCH(P4,$I$31:$M$31,0)))","v":{"$error":"#N/A"}},{"$f":"IF(ISERROR(MATCH($P$2,$H$32:$H$50,0)),VLOOKUP($P$2,$H$32:$M$50,MATCH(Q$4,$I$31:$M$31,0)+1,TRUE)+($P$2-VLOOKUP($P$2,$H$32:$H$50,1,TRUE))*(INDEX($I$32:$M$50,MATCH($P$2,$H$32:$H$50,1)+1,MATCH(Q$4,$I$31:$M$31,0))-INDEX($I$32:$M$50,MATCH($P$2,$H$32:$H$50,1),MATCH(Q$4,$I$31:$M$31,0)))/(INDEX($H$32:$H$50,MATCH($P$2,$H$32:$H$50,1)+1)-INDEX($H$32:$H$50,MATCH($P$2,$H$32:$H$50,1))),INDEX($I$32:$M$50,MATCH($P$2,$H$32:$H$50,0),MATCH(Q4,$I$31:$M$31,0)))","v":{"$error":"#N/A"}},{"$f":"IF(ISERROR(MATCH($P$2,$H$32:$H$50,0)),VLOOKUP($P$2,$H$32:$M$50,MATCH(R$4,$I$31:$M$31,0)+1,TRUE)+($P$2-VLOOKUP($P$2,$H$32:$H$50,1,TRUE))*(INDEX($I$32:$M$50,MATCH($P$2,$H$32:$H$50,1)+1,MATCH(R$4,$I$31:$M$31,0))-INDEX($I$32:$M$50,MATCH($P$2,$H$32:$H$50,1),MATCH(R$4,$I$31:$M$31,0)))/(INDEX($H$32:$H$50,MATCH($P$2,$H$32:$H$50,1)+1)-INDEX($H$32:$H$50,MATCH($P$2,$H$32:$H$50,1))),INDEX($I$32:$M$50,MATCH($P$2,$H$32:$H$50,0),MATCH(R4,$I$31:$M$31,0)))","v":{"$error":"#N/A"}},{"$f":"IF(ISERROR(MATCH($P$2,$H$32:$H$50,0)),VLOOKUP($P$2,$H$32:$M$50,MATCH(S$4,$I$31:$M$31,0)+1,TRUE)+($P$2-VLOOKUP($P$2,$H$32:$H$50,1,TRUE))*(INDEX($I$32:$M$50,MATCH($P$2,$H$32:$H$50,1)+1,MATCH(S$4,$I$31:$M$31,0))-INDEX($I$32:$M$50,MATCH($P$2,$H$32:$H$50,1),MATCH(S$4,$I$31:$M$31,0)))/(INDEX($H$32:$H$50,MATCH($P$2,$H$32:$H$50,1)+1)-INDEX($H$32:$H$50,MATCH($P$2,$H$32:$H$50,1))),INDEX($I$32:$M$50,MATCH($P$2,$H$32:$H$50,0),MATCH(S4,$I$31:$M$31,0)))","v":{"$error":"#N/A"}},{"$f":"IF(ISERROR(MATCH($P$2,$H$32:$H$50,0)),VLOOKUP($P$2,$H$32:$M$50,MATCH(T$4,$I$31:$M$31,0)+1,TRUE)+($P$2-VLOOKUP($P$2,$H$32:$H$50,1,TRUE))*(INDEX($I$32:$M$50,MATCH($P$2,$H$32:$H$50,1)+1,MATCH(T$4,$I$31:$M$31,0))-INDEX($I$32:$M$50,MATCH($P$2,$H$32:$H$50,1),MATCH(T$4,$I$31:$M$31,0)))/(INDEX($H$32:$H$50,MATCH($P$2,$H$32:$H$50,1)+1)-INDEX($H$32:$H$50,MATCH($P$2,$H$32:$H$50,1))),INDEX($I$32:$M$50,MATCH($P$2,$H$32:$H$50,0),MATCH(T4,$I$31:$M$31,0)))","v":{"$error":"#N/A"}}]
[20,185,120,80,60,35,null,{"$f":"A33/100","v":0.2},{"$f":"+B33/1609.347","v":0.11495345627760825},7.4564404071962104E-2,4.9709602714641407E-2,3.7282202035981052E-2,2.1747951187655615E-2]
[50,300,190,125,90,50,null,0.5,0.18641101017990527,0.11806030644727333,7.7671254241627199E-2,5.5923303053971578E-2,3.1068501696650878E-2]
[100,445,275,175,125,55,null,1,0.27650966510019281,0.17087675933157984,0.10873975593827807,7.7671254241627199E-2,3.4175351866315963E-2]
[200,650,385,240,160,60,null,2,0.40389052205646142,0.23922746306421175,0.14912880814392421,9.9419205429282814E-2,3.7282202035981052E-2]
[300,810,465,285,190,75,null,3,0.50330972748574421,0.28893706577885314,0.17709045967091,0.11806030644727333,4.6602752544976318E-2]
[400,935,550,325,205,80,null,4,0.58098098172737145,0.34175351866315967,0.20194526102823071,0.12738085695626861,4.9709602714641407E-2]
[500,1060,615,355,220,90,null,5,0.65865223596899858,0.38214257086880582,0.22058636204622123,0.13670140746526385,5.5923303053971578E-2]
[600,1180,670,380,225,95,null,6,0.73321664004096077,0.41631792273512175,0.23612061289454667,0.13980825763492896,5.9030153223636667E-2]
[700,1280,720,410,239,105,null,7,0.79535364343426251,0.44738642443177262,0.25476171391253721,0.1485074381099912,6.5243853562966844E-2]
[800,1385,770,430,245,115,null,8,0.86059749699722932,0.4784549261284235,0.26718911459119754,0.15223565831358929,7.1457553902297022E-2]
[900,1470,820,450,255,125,null,9,0.91341394988153579,0.50952342782507443,0.27961651526985792,0.15844935865291948,7.7671254241627199E-2]
[1000,1550,870,475,270,130,null,10,0.96312355259617721,0.5405919295217253,0.29515076611818336,0.16776990916191475,8.0778104411292281E-2]
[1500,1930,1055,550,285,140,null,15,1.199244165490724,0.65554538579933352,0.34175351866315967,0.17709045967091,8.6991804750622459E-2]
[2000,2250,1215,615,325,150,null,20,1.3980825763492895,0.75496459122861637,0.38214257086880582,0.20194526102823071,9.3205505089952637E-2]
[2500,2560,1345,665,355,160,null,25,1.590707286868525,0.83574269563990866,0.41321107256545669,0.22058636204622123,9.9419205429282814E-2]
[3000,2810,1460,695,360,170,null,30,1.7460497953517793,0.90720024954220568,0.43185217358344719,0.22369321221588631,0.10563290576861299]
[3500,3005,1580,740,375,180,null,35,{"$f":"+B49/1609.347","v":1.8672169519687178},0.98176465361416776,0.45981382511043301,0.23301376272488158,0.11184660610794316]
[4000,3185,1655,775,390,190,null,40,1.9790635580766609,1.0283674061591441,0.48156177629808861,0.24233431323387686,0.11806030644727333]
[]
[]
["Grand Island, NE-AERMOD setback distances (South) as reported in the Odor Footprint Tool"]
[]
["Setback Distances (m) for Grand Island, South",null,null,null,null,null,null,"Setback Distances (mi) for Grand Island, South"]
["x 104","Annoyance Free Percentage",null,null,null,null,null,"x 106","Annoyance Free Percentage"]
["OU/s",99,98,96,94,90,null,"OU/s",99,98,96,94,90,null,"Separation distance",{"$f":"IF(ISERROR(MATCH($P$1,$H$58:$H$76,0)),VLOOKUP($P$1,$H$58:$M$76,MATCH(P$4,$I$57:$M$57,0)+1,TRUE)+($P$1-VLOOKUP($P$1,$H$58:$H$76,1,TRUE))*(INDEX($I$58:$M$76,MATCH($P$1,$H$58:$H$76,1)+1,MATCH(P$4,$I$57:$M$57,0))-INDEX($I$58:$M$76,MATCH($P$1,$H$58:$H$76,1),MATCH(P$4,$I$57:$M$57,0)))/(INDEX($H$58:$H$76,MATCH($P$1,$H$58:$H$76,1)+1)-INDEX($H$58:$H$76,MATCH($P$1,$H$58:$H$76,1))),INDEX($I$58:$M$76,MATCH($P$1,$H$58:$H$76,0),MATCH(P$4,$I$57:$M$57,0)))","v":{"$error":"#N/A"}},{"$f":"IF(ISERROR(MATCH($P$1,$H$58:$H$76,0)),VLOOKUP($P$1,$H$58:$M$76,MATCH(Q$4,$I$57:$M$57,0)+1,TRUE)+($P$1-VLOOKUP($P$1,$H$58:$H$76,1,TRUE))*(INDEX($I$58:$M$76,MATCH($P$1,$H$58:$H$76,1)+1,MATCH(Q$4,$I$57:$M$57,0))-INDEX($I$58:$M$76,MATCH($P$1,$H$58:$H$76,1),MATCH(Q$4,$I$57:$M$57,0)))/(INDEX($H$58:$H$76,MATCH($P$1,$H$58:$H$76,1)+1)-INDEX($H$58:$H$76,MATCH($P$1,$H$58:$H$76,1))),INDEX($I$58:$M$76,MATCH($P$1,$H$58:$H$76,0),MATCH(Q$4,$I$57:$M$57,0)))","v":{"$error":"#N/A"}},{"$f":"IF(ISERROR(MATCH($P$1,$H$58:$H$76,0)),VLOOKUP($P$1,$H$58:$M$76,MATCH(R$4,$I$57:$M$57,0)+1,TRUE)+($P$1-VLOOKUP($P$1,$H$58:$H$76,1,TRUE))*(INDEX($I$58:$M$76,MATCH($P$1,$H$58:$H$76,1)+1,MATCH(R$4,$I$57:$M$57,0))-INDEX($I$58:$M$76,MATCH($P$1,$H$58:$H$76,1),MATCH(R$4,$I$57:$M$57,0)))/(INDEX($H$58:$H$76,MATCH($P$1,$H$58:$H$76,1)+1)-INDEX($H$58:$H$76,MATCH($P$1,$H$58:$H$76,1))),INDEX($I$58:$M$76,MATCH($P$1,$H$58:$H$76,0),MATCH(R$4,$I$57:$M$57,0)))","v":{"$error":"#N/A"}},{"$f":"IF(ISERROR(MATCH($P$1,$H$58:$H$76,0)),VLOOKUP($P$1,$H$58:$M$76,MATCH(S$4,$I$57:$M$57,0)+1,TRUE)+($P$1-VLOOKUP($P$1,$H$58:$H$76,1,TRUE))*(INDEX($I$58:$M$76,MATCH($P$1,$H$58:$H$76,1)+1,MATCH(S$4,$I$57:$M$57,0))-INDEX($I$58:$M$76,MATCH($P$1,$H$58:$H$76,1),MATCH(S$4,$I$57:$M$57,0)))/(INDEX($H$58:$H$76,MATCH($P$1,$H$58:$H$76,1)+1)-INDEX($H$58:$H$76,MATCH($P$1,$H$58:$H$76,1))),INDEX($I$58:$M$76,MATCH($P$1,$H$58:$H$76,0),MATCH(S$4,$I$57:$M$57,0)))","v":{"$error":"#N/A"}},{"$f":"IF(ISERROR(MATCH($P$1,$H$58:$H$76,0)),VLOOKUP($P$1,$H$58:$M$76,MATCH(T$4,$I$57:$M$57,0)+1,TRUE)+($P$1-VLOOKUP($P$1,$H$58:$H$76,1,TRUE))*(INDEX($I$58:$M$76,MATCH($P$1,$H$58:$H$76,1)+1,MATCH(T$4,$I$57:$M$57,0))-INDEX($I$58:$M$76,MATCH($P$1,$H$58:$H$76,1),MATCH(T$4,$I$57:$M$57,0)))/(INDEX($H$58:$H$76,MATCH($P$1,$H$58:$H$76,1)+1)-INDEX($H$58:$H$76,MATCH($P$1,$H$58:$H$76,1))),INDEX($I$58:$M$76,MATCH($P$1,$H$58:$H$76,0),MATCH(T$4,$I$57:$M$57,0)))","v":{"$error":"#N/A"}}]
[0,0,0,0,0,0,null,{"$f":"A58/100","v":0},0,0,0,0,0,null,"New Separation distance",{"$f":"IF(ISERROR(MATCH($P$2,$H$58:$H$76,0)),VLOOKUP($P$2,$H$58:$M$76,MATCH(P$4,$I$57:$M$57,0)+1,TRUE)+($P$2-VLOOKUP($P$2,$H$58:$H$76,1,TRUE))*(INDEX($I$58:$M$76,MATCH($P$2,$H$58:$H$76,1)+1,MATCH(P$4,$I$57:$M$57,0))-INDEX($I$58:$M$76,MATCH($P$2,$H$58:$H$76,1),MATCH(P$4,$I$57:$M$57,0)))/(INDEX($H$58:$H$76,MATCH($P$2,$H$58:$H$76,1)+1)-INDEX($H$58:$H$76,MATCH($P$2,$H$58:$H$76,1))),INDEX($I$58:$M$76,MATCH($P$2,$H$58:$H$76,0),MATCH(P4,$I$57:$M$57,0)))","v":{"$error":"#N/A"}},{"$f":"IF(ISERROR(MATCH($P$2,$H$58:$H$76,0)),VLOOKUP($P$2,$H$58:$M$76,MATCH(Q$4,$I$57:$M$57,0)+1,TRUE)+($P$2-VLOOKUP($P$2,$H$58:$H$76,1,TRUE))*(INDEX($I$58:$M$76,MATCH($P$2,$H$58:$H$76,1)+1,MATCH(Q$4,$I$57:$M$57,0))-INDEX($I$58:$M$76,MATCH($P$2,$H$58:$H$76,1),MATCH(Q$4,$I$57:$M$57,0)))/(INDEX($H$58:$H$76,MATCH($P$2,$H$58:$H$76,1)+1)-INDEX($H$58:$H$76,MATCH($P$2,$H$58:$H$76,1))),INDEX($I$58:$M$76,MATCH($P$2,$H$58:$H$76,0),MATCH(Q4,$I$57:$M$57,0)))","v":{"$error":"#N/A"}},{"$f":"IF(ISERROR(MATCH($P$2,$H$58:$H$76,0)),VLOOKUP($P$2,$H$58:$M$76,MATCH(R$4,$I$57:$M$57,0)+1,TRUE)+($P$2-VLOOKUP($P$2,$H$58:$H$76,1,TRUE))*(INDEX($I$58:$M$76,MATCH($P$2,$H$58:$H$76,1)+1,MATCH(R$4,$I$57:$M$57,0))-INDEX($I$58:$M$76,MATCH($P$2,$H$58:$H$76,1),MATCH(R$4,$I$57:$M$57,0)))/(INDEX($H$58:$H$76,MATCH($P$2,$H$58:$H$76,1)+1)-INDEX($H$58:$H$76,MATCH($P$2,$H$58:$H$76,1))),INDEX($I$58:$M$76,MATCH($P$2,$H$58:$H$76,0),MATCH(R4,$I$57:$M$57,0)))","v":{"$error":"#N/A"}},{"$f":"IF(ISERROR(MATCH($P$2,$H$58:$H$76,0)),VLOOKUP($P$2,$H$58:$M$76,MATCH(S$4,$I$57:$M$57,0)+1,TRUE)+($P$2-VLOOKUP($P$2,$H$58:$H$76,1,TRUE))*(INDEX($I$58:$M$76,MATCH($P$2,$H$58:$H$76,1)+1,MATCH(S$4,$I$57:$M$57,0))-INDEX($I$58:$M$76,MATCH($P$2,$H$58:$H$76,1),MATCH(S$4,$I$57:$M$57,0)))/(INDEX($H$58:$H$76,MATCH($P$2,$H$58:$H$76,1)+1)-INDEX($H$58:$H$76,MATCH($P$2,$H$58:$H$76,1))),INDEX($I$58:$M$76,MATCH($P$2,$H$58:$H$76,0),MATCH(S4,$I$57:$M$57,0)))","v":{"$error":"#N/A"}},{"$f":"IF(ISERROR(MATCH($P$2,$H$58:$H$76,0)),VLOOKUP($P$2,$H$58:$M$76,MATCH(T$4,$I$57:$M$57,0)+1,TRUE)+($P$2-VLOOKUP($P$2,$H$58:$H$76,1,TRUE))*(INDEX($I$58:$M$76,MATCH($P$2,$H$58:$H$76,1)+1,MATCH(T$4,$I$57:$M$57,0))-INDEX($I$58:$M$76,MATCH($P$2,$H$58:$H$76,1),MATCH(T$4,$I$57:$M$57,0)))/(INDEX($H$58:$H$76,MATCH($P$2,$H$58:$H$76,1)+1)-INDEX($H$58:$H$76,MATCH($P$2,$H$58:$H$76,1))),INDEX($I$58:$M$76,MATCH($P$2,$H$58:$H$76,0),MATCH(T4,$I$57:$M$57,0)))","v":{"$error":"#N/A"}}]
[20,170,125,95,80,55,null,{"$f":"A59/100","v":0.2},{"$f":"+B59/1609.347","v":0.10563290576861299},7.7671254241627199E-2,5.9030153223636667E-2,4.9709602714641407E-2,3.4175351866315963E-2]
[50,290,205,155,125,90,null,0.5,0.18019730984057508,0.12738085695626861,9.6312355259617718E-2,7.7671254241627199E-2,5.5923303053971578E-2]
[100,430,300,220,175,115,null,1,0.26718911459119754,0.18641101017990527,0.13670140746526385,0.10873975593827807,7.1457553902297022E-2]
[200,640,435,315,250,160,null,2,0.39767682171713126,0.27029596476086265,0.19573156068890052,0.1553425084832544,9.9419205429282814E-2]
[300,795,540,385,305,185,null,3,0.49398917697674893,0.33553981832382951,0.23922746306421175,0.18951786034957036,0.11495345627760825]
[400,940,630,445,345,205,null,4,0.5840878318970365,0.39146312137780104,0.27650966510019281,0.21437266170689107,0.12738085695626861]
[500,1055,715,500,385,220,null,5,0.65554538579933352,0.44427957426210757,0.3106850169665088,0.23922746306421175,0.13670140746526385]
[600,1190,780,555,420,230,null,6,0.73943034038029087,0.48466862646775372,0.34486036883282473,0.26097541425186738,0.14291510780459404]
[700,1295,850,590,455,245,null,7,0.80467419394325779,0.52816452884306497,0.36660832002048038,0.28272336543952298,0.15223565831358929]
[800,1410,910,630,480,250,null,8,0.87613174784555481,0.56544673087904596,0.39146312137780104,0.29825761628784841,0.1553425084832544]
[900,1505,970,665,500,270,null,9,0.93516190106919139,0.60272893291502705,0.41321107256545669,0.3106850169665088,0.16776990916191475]
[1000,1600,1030,705,530,285,null,10,0.99419205429282809,0.64001113495100814,0.4380658739227774,0.32932611798449929,0.17709045967091]
[1500,2020,1275,865,630,330,null,15,1.2551674685446954,0.79224679326459735,0.53748507935206014,0.39146312137780104,0.20505211119789579]
[2000,2395,1485,990,720,340,null,20,1.488181231269577,0.92273450039053106,0.61515633359368738,0.44738642443177262,0.21126581153722598]
[2500,2725,1675,1120,800,365,null,25,1.6932333424674728,1.0407948068378043,0.69593443800497967,0.49709602714641404,0.22680006238555142]
[3000,3035,1830,1210,840,405,null,30,1.8858580529867084,1.1371071620974222,0.7518577410589512,0.52195082850373475,0.2516548637428721]
[3500,3325,1975,1295,890,415,null,35,{"$f":"+B75/1609.347","v":2.0660553628272833},1.2272058170177096,0.80467419394325779,0.55301933020038563,0.25786856408220227]
[4000,3540,2130,1385,935,430,null,40,2.1996499201228823,1.3235181722773275,0.86059749699722932,0.58098098172737145,0.26718911459119754]
[]
[]
["Grand Island, NE-AERMOD setback distances (West) as reported in the Odor Footprint Tool"]
[]
["Setback Distances (m) for Grand Island, West",null,null,null,null,null,null,"Setback Distances (mi) for Grand Island, West"]
["x 104","Annoyance Free Percentage",null,null,null,null,null,"x 106","Annoyance Free Percentage"]
["OU/s",99,98,96,94,90,null,"OU/s",99,98,96,94,90,null,"Separation distance",{"$f":"IF(ISERROR(MATCH($P$1,$H$84:$H$102,0)),VLOOKUP($P$1,$H$84:$M$102,MATCH(P$4,$I$83:$M$83,0)+1,TRUE)+($P$1-VLOOKUP($P$1,$H$84:$H$102,1,TRUE))*(INDEX($I$84:$M$102,MATCH($P$1,$H$84:$H$102,1)+1,MATCH(P$4,$I$83:$M$83,0))-INDEX($I$84:$M$102,MATCH($P$1,$H$84:$H$102,1),MATCH(P$4,$I$83:$M$83,0)))/(INDEX($H$84:$H$102,MATCH($P$1,$H$84:$H$102,1)+1)-INDEX($H$84:$H$102,MATCH($P$1,$H$84:$H$102,1))),INDEX($I$84:$M$102,MATCH($P$1,$H$84:$H$102,0),MATCH(P4,$I$83:$M$83,0)))","v":{"$error":"#N/A"}},{"$f":"IF(ISERROR(MATCH($P$1,$H$84:$H$102,0)),VLOOKUP($P$1,$H$84:$M$102,MATCH(Q$4,$I$83:$M$83,0)+1,TRUE)+($P$1-VLOOKUP($P$1,$H$84:$H$102,1,TRUE))*(INDEX($I$84:$M$102,MATCH($P$1,$H$84:$H$102,1)+1,MATCH(Q$4,$I$83:$M$83,0))-INDEX($I$84:$M$102,MATCH($P$1,$H$84:$H$102,1),MATCH(Q$4,$I$83:$M$83,0)))/(INDEX($H$84:$H$102,MATCH($P$1,$H$84:$H$102,1)+1)-INDEX($H$84:$H$102,MATCH($P$1,$H$84:$H$102,1))),INDEX($I$84:$M$102,MATCH($P$1,$H$84:$H$102,0),MATCH(Q4,$I$83:$M$83,0)))","v":{"$error":"#N/A"}},{"$f":"IF(ISERROR(MATCH($P$1,$H$84:$H$102,0)),VLOOKUP($P$1,$H$84:$M$102,MATCH(R$4,$I$83:$M$83,0)+1,TRUE)+($P$1-VLOOKUP($P$1,$H$84:$H$102,1,TRUE))*(INDEX($I$84:$M$102,MATCH($P$1,$H$84:$H$102,1)+1,MATCH(R$4,$I$83:$M$83,0))-INDEX($I$84:$M$102,MATCH($P$1,$H$84:$H$102,1),MATCH(R$4,$I$83:$M$83,0)))/(INDEX($H$84:$H$102,MATCH($P$1,$H$84:$H$102,1)+1)-INDEX($H$84:$H$102,MATCH($P$1,$H$84:$H$102,1))),INDEX($I$84:$M$102,MATCH($P$1,$H$84:$H$102,0),MATCH(R4,$I$83:$M$83,0)))","v":{"$error":"#N/A"}},{"$f":"IF(ISERROR(MATCH($P$1,$H$84:$H$102,0)),VLOOKUP($P$1,$H$84:$M$102,MATCH(S$4,$I$83:$M$83,0)+1,TRUE)+($P$1-VLOOKUP($P$1,$H$84:$H$102,1,TRUE))*(INDEX($I$84:$M$102,MATCH($P$1,$H$84:$H$102,1)+1,MATCH(S$4,$I$83:$M$83,0))-INDEX($I$84:$M$102,MATCH($P$1,$H$84:$H$102,1),MATCH(S$4,$I$83:$M$83,0)))/(INDEX($H$84:$H$102,MATCH($P$1,$H$84:$H$102,1)+1)-INDEX($H$84:$H$102,MATCH($P$1,$H$84:$H$102,1))),INDEX($I$84:$M$102,MATCH($P$1,$H$84:$H$102,0),MATCH(S4,$I$83:$M$83,0)))","v":{"$error":"#N/A"}},{"$f":"IF(ISERROR(MATCH($P$1,$H$84:$H$102,0)),VLOOKUP($P$1,$H$84:$M$102,MATCH(T$4,$I$83:$M$83,0)+1,TRUE)+($P$1-VLOOKUP($P$1,$H$84:$H$102,1,TRUE))*(INDEX($I$84:$M$102,MATCH($P$1,$H$84:$H$102,1)+1,MATCH(T$4,$I$83:$M$83,0))-INDEX($I$84:$M$102,MATCH($P$1,$H$84:$H$102,1),MATCH(T$4,$I$83:$M$83,0)))/(INDEX($H$84:$H$102,MATCH($P$1,$H$84:$H$102,1)+1)-INDEX($H$84:$H$102,MATCH($P$1,$H$84:$H$102,1))),INDEX($I$84:$M$102,MATCH($P$1,$H$84:$H$102,0),MATCH(T4,$I$83:$M$83,0)))","v":{"$error":"#N/A"}}]
[0,0,0,0,0,0,null,{"$f":"A84/100","v":0},0,0,0,0,0,null,"New Separation distance",{"$f":"IF(ISERROR(MATCH($P$2,$H$84:$H$102,0)),VLOOKUP($P$2,$H$84:$M$102,MATCH(P$4,$I$83:$M$83,0)+1,TRUE)+($P$2-VLOOKUP($P$2,$H$84:$H$102,1,TRUE))*(INDEX($I$84:$M$102,MATCH($P$2,$H$84:$H$102,1)+1,MATCH(P$4,$I$83:$M$83,0))-INDEX($I$84:$M$102,MATCH($P$2,$H$84:$H$102,1),MATCH(P$4,$I$83:$M$83,0)))/(INDEX($H$84:$H$102,MATCH($P$2,$H$84:$H$102,1)+1)-INDEX($H$84:$H$102,MATCH($P$2,$H$84:$H$102,1))),INDEX($I$84:$M$102,MATCH($P$2,$H$84:$H$102,0),MATCH(P4,$I$83:$M$83,0)))","v":{"$error":"#N/A"}},{"$f":"IF(ISERROR(MATCH($P$2,$H$84:$H$102,0)),VLOOKUP($P$2,$H$84:$M$102,MATCH(Q$4,$I$83:$M$83,0)+1,TRUE)+($P$2-VLOOKUP($P$2,$H$84:$H$102,1,TRUE))*(INDEX($I$84:$M$102,MATCH($P$2,$H$84:$H$102,1)+1,MATCH(Q$4,$I$83:$M$83,0))-INDEX($I$84:$M$102,MATCH($P$2,$H$84:$H$102,1),MATCH(Q$4,$I$83:$M$83,0)))/(INDEX($H$84:$H$102,MATCH($P$2,$H$84:$H$102,1)+1)-INDEX($H$84:$H$102,MATCH($P$2,$H$84:$H$102,1))),INDEX($I$84:$M$102,MATCH($P$2,$H$84:$H$102,0),MATCH(Q4,$I$83:$M$83,0)))","v":{"$error":"#N/A"}},{"$f":"IF(ISERROR(MATCH($P$2,$H$84:$H$102,0)),VLOOKUP($P$2,$H$84:$M$102,MATCH(R$4,$I$83:$M$83,0)+1,TRUE)+($P$2-VLOOKUP($P$2,$H$84:$H$102,1,TRUE))*(INDEX($I$84:$M$102,MATCH($P$2,$H$84:$H$102,1)+1,MATCH(R$4,$I$83:$M$83,0))-INDEX($I$84:$M$102,MATCH($P$2,$H$84:$H$102,1),MATCH(R$4,$I$83:$M$83,0)))/(INDEX($H$84:$H$102,MATCH($P$2,$H$84:$H$102,1)+1)-INDEX($H$84:$H$102,MATCH($P$2,$H$84:$H$102,1))),INDEX($I$84:$M$102,MATCH($P$2,$H$84:$H$102,0),MATCH(R4,$I$83:$M$83,0)))","v":{"$error":"#N/A"}},{"$f":"IF(ISERROR(MATCH($P$2,$H$84:$H$102,0)),VLOOKUP($P$2,$H$84:$M$102,MATCH(S$4,$I$83:$M$83,0)+1,TRUE)+($P$2-VLOOKUP($P$2,$H$84:$H$102,1,TRUE))*(INDEX($I$84:$M$102,MATCH($P$2,$H$84:$H$102,1)+1,MATCH(S$4,$I$83:$M$83,0))-INDEX($I$84:$M$102,MATCH($P$2,$H$84:$H$102,1),MATCH(S$4,$I$83:$M$83,0)))/(INDEX($H$84:$H$102,MATCH($P$2,$H$84:$H$102,1)+1)-INDEX($H$84:$H$102,MATCH($P$2,$H$84:$H$102,1))),INDEX($I$84:$M$102,MATCH($P$2,$H$84:$H$102,0),MATCH(S4,$I$83:$M$83,0)))","v":{"$error":"#N/A"}},{"$f":"IF(ISERROR(MATCH($P$2,$H$84:$H$102,0)),VLOOKUP($P$2,$H$84:$M$102,MATCH(T$4,$I$83:$M$83,0)+1,TRUE)+($P$2-VLOOKUP($P$2,$H$84:$H$102,1,TRUE))*(INDEX($I$84:$M$102,MATCH($P$2,$H$84:$H$102,1)+1,MATCH(T$4,$I$83:$M$83,0))-INDEX($I$84:$M$102,MATCH($P$2,$H$84:$H$102,1),MATCH(T$4,$I$83:$M$83,0)))/(INDEX($H$84:$H$102,MATCH($P$2,$H$84:$H$102,1)+1)-INDEX($H$84:$H$102,MATCH($P$2,$H$84:$H$102,1))),INDEX($I$84:$M$102,MATCH($P$2,$H$84:$H$102,0),MATCH(T4,$I$83:$M$83,0)))","v":{"$error":"#N/A"}}]
[20,175,125,95,80,60,null,{"$f":"A85/100","v":0.2},{"$f":"+B85/1609.347","v":0.10873975593827807},7.7671254241627199E-2,5.9030153223636667E-2,4.9709602714641407E-2,3.7282202035981052E-2]
[50,290,205,150,125,90,null,0.5,0.18019730984057508,0.12738085695626861,9.3205505089952637E-2,7.7671254241627199E-2,5.5923303053971578E-2]
[100,435,305,215,175,130,null,1,0.27029596476086265,0.18951786034957036,0.13359455729559877,0.10873975593827807,8.0778104411292281E-2]
[200,650,450,315,255,165,null,2,0.40389052205646142,0.27961651526985792,0.19573156068890052,0.15844935865291948,0.1025260555989479]
[300,825,555,370,290,200,null,3,0.51263027799473948,0.34486036883282473,0.2299069125552165,0.18019730984057508,0.12427400678660351]
[400,970,655,440,335,220,null,4,0.60272893291502705,0.40699737222612647,0.2734028149305277,0.20815896136756087,0.13670140746526385]
[500,1090,735,490,380,240,null,5,0.67729333698698913,0.4567069749407679,0.30447131662717858,0.23612061289454667,0.14912880814392421]
[600,1210,810,540,410,255,null,6,0.7518577410589512,0.50330972748574421,0.33553981832382951,0.25476171391253721,0.15844935865291948]
[700,1310,880,590,440,270,null,7,0.81399474445225295,0.54680562986105541,0.36660832002048038,0.2734028149305277,0.16776990916191475]
[800,1400,940,630,465,300,null,8,0.86991804750622459,0.5840878318970365,0.39146312137780104,0.28893706577885314,0.18641101017990527]
[900,1510,995,665,495,320,null,9,0.93826875123885656,0.61826318376335243,0.41321107256545669,0.30757816679684369,0.19883841085856563]
[1000,1595,1050,710,520,330,null,10,0.99108520412316303,0.65243853562966847,0.44117272409244246,0.32311241764516913,0.20505211119789579]
[1500,2015,1295,845,635,390,null,15,1.2520606183750305,0.80467419394325779,0.52505767867339981,0.39456997154746615,0.24233431323387686]
[2000,2360,1520,980,725,420,null,20,1.4664332800819215,0.94448245157818667,0.60894263325435716,0.45049327460143773,0.26097541425186738]
[2500,2700,1725,1090,790,440,null,25,1.6776990916191474,1.0718633085344553,0.67729333698698913,0.49088232680708388,0.2734028149305277]
[3000,2995,1900,1230,880,465,null,30,1.8610032516293875,1.1806030644727334,0.76428514173761164,0.54680562986105541,0.28893706577885314]
[3500,3260,2080,1340,950,485,null,35,{"$f":"+B101/1609.347","v":2.025666310621637},1.2924496705806765,0.8326358454702435,0.59030153223636672,0.30136446645751352]
[4000,3570,2250,1465,1020,530,null,40,2.2182910211408728,1.3980825763492895,0.91030709971187074,0.63379743461167792,0.32932611798449929]

{"sheet":"Ainsworth","index":6,"n_rows":98,"n_cols":20,"rows_kept":98,"cut":false,"hidden":true,"merged":[[53,1,53,5],[53,8,53,12],[78,1,78,5],[78,8,78,12],[3,1,3,5],[3,8,3,12],[28,1,28,5],[28,8,28,12]]}
["Ainsworth, NE-AERMOD setback distances (NE) as reported in the Odor Footprint Tool",null,null,null,null,null,null,null,null,null,null,null,null,null,"Total Scaled Odor Emission Rate (x10^6)",{"$f":"Inputs!E33","v":""}]
[null,null,null,null,null,null,null,null,null,null,null,null,null,null,"New Total Scaled Odor Emission Rate (x10^6)",{"$f":"Inputs!E42","v":""}]
["Setback Distances (m) for Ainsworth, NE",null,null,null,null,null,null,"Setback Distances (mi) for Ainsworth, NE"]
["x 104","Annoyance Free Percentage",null,null,null,null,null,"x 106","Annoyance Free Percentage",null,null,null,null,null,"Annoyance free percentage",99,98,96,94,90]
["OU/s",99,98,96,94,90,null,"OU/s",99,98,96,94,90,null,"Separation distance",{"$f":"IF(ISERROR(MATCH($P$1,$H$6:$H$23,0)),VLOOKUP($P$1,$H$6:$M$23,MATCH(P4,$I$5:$M$5,0)+1,TRUE)+($P$1-VLOOKUP($P$1,$H$6:$H$23,1,TRUE))*(INDEX($I$6:$M$23,MATCH($P$1,$H$6:$H$23,1)+1,MATCH(P4,$I$5:$M$5,0))-INDEX($I$6:$M$23,MATCH($P$1,$H$6:$H$23,1),MATCH(P4,$I$5:$M$5,0)))/(INDEX($H$6:$H$23,MATCH($P$1,$H$6:$H$23,1)+1)-INDEX($H$6:$H$23,MATCH($P$1,$H$6:$H$23,1))),INDEX($I$6:$M$23,MATCH($P$1,$H$6:$H$23,0),MATCH(P4,$I$5:$M$5,0)))","v":{"$error":"#N/A"}},{"$f":"IF(ISERROR(MATCH($P$1,$H$6:$H$23,0)),VLOOKUP($P$1,$H$6:$M$23,MATCH(Q4,$I$5:$M$5,0)+1,TRUE)+($P$1-VLOOKUP($P$1,$H$6:$H$23,1,TRUE))*(INDEX($I$6:$M$23,MATCH($P$1,$H$6:$H$23,1)+1,MATCH(Q4,$I$5:$M$5,0))-INDEX($I$6:$M$23,MATCH($P$1,$H$6:$H$23,1),MATCH(Q4,$I$5:$M$5,0)))/(INDEX($H$6:$H$23,MATCH($P$1,$H$6:$H$23,1)+1)-INDEX($H$6:$H$23,MATCH($P$1,$H$6:$H$23,1))),INDEX($I$6:$M$23,MATCH($P$1,$H$6:$H$23,0),MATCH(Q4,$I$5:$M$5,0)))","v":{"$error":"#N/A"}},{"$f":"IF(ISERROR(MATCH($P$1,$H$6:$H$23,0)),VLOOKUP($P$1,$H$6:$M$23,MATCH(R4,$I$5:$M$5,0)+1,TRUE)+($P$1-VLOOKUP($P$1,$H$6:$H$23,1,TRUE))*(INDEX($I$6:$M$23,MATCH($P$1,$H$6:$H$23,1)+1,MATCH(R4,$I$5:$M$5,0))-INDEX($I$6:$M$23,MATCH($P$1,$H$6:$H$23,1),MATCH(R4,$I$5:$M$5,0)))/(INDEX($H$6:$H$23,MATCH($P$1,$H$6:$H$23,1)+1)-INDEX($H$6:$H$23,MATCH($P$1,$H$6:$H$23,1))),INDEX($I$6:$M$23,MATCH($P$1,$H$6:$H$23,0),MATCH(R4,$I$5:$M$5,0)))","v":{"$error":"#N/A"}},{"$f":"IF(ISERROR(MATCH($P$1,$H$6:$H$23,0)),VLOOKUP($P$1,$H$6:$M$23,MATCH(S4,$I$5:$M$5,0)+1,TRUE)+($P$1-VLOOKUP($P$1,$H$6:$H$23,1,TRUE))*(INDEX($I$6:$M$23,MATCH($P$1,$H$6:$H$23,1)+1,MATCH(S4,$I$5:$M$5,0))-INDEX($I$6:$M$23,MATCH($P$1,$H$6:$H$23,1),MATCH(S4,$I$5:$M$5,0)))/(INDEX($H$6:$H$23,MATCH($P$1,$H$6:$H$23,1)+1)-INDEX($H$6:$H$23,MATCH($P$1,$H$6:$H$23,1))),INDEX($I$6:$M$23,MATCH($P$1,$H$6:$H$23,0),MATCH(S4,$I$5:$M$5,0)))","v":{"$error":"#N/A"}},{"$f":"IF(ISERROR(MATCH($P$1,$H$6:$H$23,0)),VLOOKUP($P$1,$H$6:$M$23,MATCH(T4,$I$5:$M$5,0)+1,TRUE)+($P$1-VLOOKUP($P$1,$H$6:$H$23,1,TRUE))*(INDEX($I$6:$M$23,MATCH($P$1,$H$6:$H$23,1)+1,MATCH(T4,$I$5:$M$5,0))-INDEX($I$6:$M$23,MATCH($P$1,$H$6:$H$23,1),MATCH(T4,$I$5:$M$5,0)))/(INDEX($H$6:$H$23,MATCH($P$1,$H$6:$H$23,1)+1)-INDEX($H$6:$H$23,MATCH($P$1,$H$6:$H$23,1))),INDEX($I$6:$M$23,MATCH($P$1,$H$6:$H$23,0),MATCH(T4,$I$5:$M$5,0)))","v":{"$error":"#N/A"}}]
[0,0,0,0,0,0,null,{"$f":"A6/100","v":0},0,0,0,0,0,null,"New Separation distance",{"$f":"IF(ISERROR(MATCH($P$2,$H$6:$H$23,0)),VLOOKUP($P$2,$H$6:$M$23,MATCH(P4,$I$5:$M$5,0)+1,TRUE)+($P$2-VLOOKUP($P$2,$H$6:$H$23,1,TRUE))*(INDEX($I$6:$M$23,MATCH($P$2,$H$6:$H$23,1)+1,MATCH(P4,$I$5:$M$5,0))-INDEX($I$6:$M$23,MATCH($P$2,$H$6:$H$23,1),MATCH(P4,$I$5:$M$5,0)))/(INDEX($H$6:$H$23,MATCH($P$2,$H$6:$H$23,1)+1)-INDEX($H$6:$H$23,MATCH($P$2,$H$6:$H$23,1))),INDEX($I$6:$M$23,MATCH($P$2,$H$6:$H$23,0),MATCH(P4,$I$5:$M$5,0)))","v":{"$error":"#N/A"}},{"$f":"IF(ISERROR(MATCH($P$2,$H$6:$H$23,0)),VLOOKUP($P$2,$H$6:$M$23,MATCH(Q4,$I$5:$M$5,0)+1,TRUE)+($P$2-VLOOKUP($P$2,$H$6:$H$23,1,TRUE))*(INDEX($I$6:$M$23,MATCH($P$2,$H$6:$H$23,1)+1,MATCH(Q4,$I$5:$M$5,0))-INDEX($I$6:$M$23,MATCH($P$2,$H$6:$H$23,1),MATCH(Q4,$I$5:$M$5,0)))/(INDEX($H$6:$H$23,MATCH($P$2,$H$6:$H$23,1)+1)-INDEX($H$6:$H$23,MATCH($P$2,$H$6:$H$23,1))),INDEX($I$6:$M$23,MATCH($P$2,$H$6:$H$23,0),MATCH(Q4,$I$5:$M$5,0)))","v":{"$error":"#N/A"}},{"$f":"IF(ISERROR(MATCH($P$2,$H$6:$H$23,0)),VLOOKUP($P$2,$H$6:$M$23,MATCH(R4,$I$5:$M$5,0)+1,TRUE)+($P$2-VLOOKUP($P$2,$H$6:$H$23,1,TRUE))*(INDEX($I$6:$M$23,MATCH($P$2,$H$6:$H$23,1)+1,MATCH(R4,$I$5:$M$5,0))-INDEX($I$6:$M$23,MATCH($P$2,$H$6:$H$23,1),MATCH(R4,$I$5:$M$5,0)))/(INDEX($H$6:$H$23,MATCH($P$2,$H$6:$H$23,1)+1)-INDEX($H$6:$H$23,MATCH($P$2,$H$6:$H$23,1))),INDEX($I$6:$M$23,MATCH($P$2,$H$6:$H$23,0),MATCH(R4,$I$5:$M$5,0)))","v":{"$error":"#N/A"}},{"$f":"IF(ISERROR(MATCH($P$2,$H$6:$H$23,0)),VLOOKUP($P$2,$H$6:$M$23,MATCH(S4,$I$5:$M$5,0)+1,TRUE)+($P$2-VLOOKUP($P$2,$H$6:$H$23,1,TRUE))*(INDEX($I$6:$M$23,MATCH($P$2,$H$6:$H$23,1)+1,MATCH(S4,$I$5:$M$5,0))-INDEX($I$6:$M$23,MATCH($P$2,$H$6:$H$23,1),MATCH(S4,$I$5:$M$5,0)))/(INDEX($H$6:$H$23,MATCH($P$2,$H$6:$H$23,1)+1)-INDEX($H$6:$H$23,MATCH($P$2,$H$6:$H$23,1))),INDEX($I$6:$M$23,MATCH($P$2,$H$6:$H$23,0),MATCH(S4,$I$5:$M$5,0)))","v":{"$error":"#N/A"}},{"$f":"IF(ISERROR(MATCH($P$2,$H$6:$H$23,0)),VLOOKUP($P$2,$H$6:$M$23,MATCH(T4,$I$5:$M$5,0)+1,TRUE)+($P$2-VLOOKUP($P$2,$H$6:$H$23,1,TRUE))*(INDEX($I$6:$M$23,MATCH($P$2,$H$6:$H$23,1)+1,MATCH(T4,$I$5:$M$5,0))-INDEX($I$6:$M$23,MATCH($P$2,$H$6:$H$23,1),MATCH(T4,$I$5:$M$5,0)))/(INDEX($H$6:$H$23,MATCH($P$2,$H$6:$H$23,1)+1)-INDEX($H$6:$H$23,MATCH($P$2,$H$6:$H$23,1))),INDEX($I$6:$M$23,MATCH($P$2,$H$6:$H$23,0),MATCH(T4,$I$5:$M$5,0)))","v":{"$error":"#N/A"}}]
[50,907.8,514,287.10000000000002,202.8,135.6,null,{"$f":"A7/100","v":0.5},{"$f":"+B7/1609.347","v":0.56407971680439328},{"$f":"+C7/1609.347","v":0.31938419744157104},{"$f":"+D7/1609.347","v":0.17839533674216937},{"$f":"+E7/1609.347","v":0.12601384288161596},{"$f":"+F7/1609.347","v":8.4257776601317183E-2}]
[100,1351.8,761.6,413,289,191.4,null,1,{"$f":"+B8/1609.347","v":0.83996801187065306},{"$f":"+C8/1609.347","v":0.47323541784338619},{"$f":"+D8/1609.347","v":0.25662582401433626},{"$f":"+E8/1609.347","v":0.17957593980664208},{"$f":"+F8/1609.347","v":0.11893022449477957}]
[200,1978.2,1118.2,592.5,403.2,266.2,null,2,{"$f":"+B9/1609.347","v":1.2291942011262953},0.69481597194390021,0.36816174510531291,0.2505363976817927,0.16540870303296926]
[300,2497.1,1401.3,727.7,488.4,315,null,3,1.5516231117341381,0.87072582855033753,0.45217097369305692,0.30347712457288578,0.19573156068890052]
[400,2977.7,1626,841.7,567.29999999999995,362.8,null,4,1.8502535500423463,1.0103476751750866,0.52300715756142091,0.35250322025020081,0.22543304831089878]
[500,3356.9,1878.6,932.9,622.29999999999995,397.1,null,5,2.0858770669097466,1.1673057457465668,0.57967610465611208,0.38667857211651679,0.24674604047480128]
[600,3732.8,2040.8,1032.4000000000001,681.2,436,null,6,2.319450062665168,1.2680919652505023,0.64150242303244742,0.42327726711517161,0.27091733479479568]
[700,4045.3,2229.6,1115.7,733.5,458.5,null,7,2.5136281982692359,1.3854066276570558,0.69326254685906774,0.4557749198898684,0.28489816055828854]
[800,4340.7,2392.1999999999998,1190,783.5,488.9,null,8,2.6971809062930494,1.4864413951745645,0.73943034038029087,0.48684342158651928,0.3037878095898523]
[900,4616.6000000000004,2543.1,1249.0999999999999,831.2,508.9,null,9,2.8686168986551692,1.580206133295057,0.77615330938573213,0.51648277220512417,0.31621521026851263]
[1000,4860.7,2687.3,1324.5,870.3,539.29999999999995,null,10,3.0202933239382181,1.6698076921881981,0.82300460994428171,0.5407783405319051,0.33510485930007633]
[1500,6076.5,3363.1,1615.8,1037.5,607.20000000000005,null,15,3.775755011193981,2.0897295611201314,1.0040097008289697,0.64467141020550567,0.37729588460412827]
[2000,7200,3943.6,1847.9,1199.3,708.8,null,20,4.4738642443177268,2.4504348658182482,1.1482296857048233,0.74520908169586797,0.44042708005172282]
[2500,8220.6,4411.8,2046,1275.5,754.1,null,25,5.1080345009497643,2.7413603157056872,1.2713230894269538,0.79255747828156387,0.46857514258888855]
[3000,9100,4851.3,2265.5,1392.1,808.9,null,30,5.6544673087904602,3.0144524456192481,1.4077138118752512,0.86500922423815374,0.50262622044841787]
[3500,9800,5234.3,2457.3000000000002,1490.1,845.3,null,35,6.0894263325435718,3.252437168615594,1.5268925843836041,0.92590348756358942,0.52524408968357972]
[4000,10633.4,5580.7,2555,1621.3,857.7,null,40,{"$f":"+B23/1609.347","v":6.6072761188233491},3.4676797483699908,1.5876004366988599,1.0074272360156014,0.53294907810434922]
[]
[]
["Ainsworth, NE-AERMOD setback distances (SE) as reported in the Odor Footprint Tool"]
[]
["Setback Distances (m) for Ainsworth, SE",null,null,null,null,null,null,"Setback Distances (mi) for Ainsworth, SE"]
["x 104","Annoyance Free Percentage",null,null,null,null,null,"x 106","Annoyance Free Percentage"]
["OU/s",99,98,96,94,90,null,"OU/s",99,98,96,94,90,null,"Separation distance",{"$f":"IF(ISERROR(MATCH($P$1,$H$31:$H$48,0)),VLOOKUP($P$1,$H$31:$M$48,MATCH(P$4,$I$30:$M$30,0)+1,TRUE)+($P$1-VLOOKUP($P$1,$H$31:$H$48,1,TRUE))*(INDEX($I$31:$M$48,MATCH($P$1,$H$31:$H$48,1)+1,MATCH(P$4,$I$30:$M$30,0))-INDEX($I$31:$M$48,MATCH($P$1,$H$31:$H$48,1),MATCH(P$4,$I$30:$M$30,0)))/(INDEX($H$31:$H$48,MATCH($P$1,$H$31:$H$48,1)+1)-INDEX($H$31:$H$48,MATCH($P$1,$H$31:$H$48,1))),INDEX($I$31:$M$48,MATCH($P$1,$H$31:$H$48,0),MATCH(P4,$I$30:$M$30,0)))","v":{"$error":"#N/A"}},{"$f":"IF(ISERROR(MATCH($P$1,$H$31:$H$48,0)),VLOOKUP($P$1,$H$31:$M$48,MATCH(Q$4,$I$30:$M$30,0)+1,TRUE)+($P$1-VLOOKUP($P$1,$H$31:$H$48,1,TRUE))*(INDEX($I$31:$M$48,MATCH($P$1,$H$31:$H$48,1)+1,MATCH(Q$4,$I$30:$M$30,0))-INDEX($I$31:$M$48,MATCH($P$1,$H$31:$H$48,1),MATCH(Q$4,$I$30:$M$30,0)))/(INDEX($H$31:$H$48,MATCH($P$1,$H$31:$H$48,1)+1)-INDEX($H$31:$H$48,MATCH($P$1,$H$31:$H$48,1))),INDEX($I$31:$M$48,MATCH($P$1,$H$31:$H$48,0),MATCH(Q4,$I$30:$M$30,0)))","v":{"$error":"#N/A"}},{"$f":"IF(ISERROR(MATCH($P$1,$H$31:$H$48,0)),VLOOKUP($P$1,$H$31:$M$48,MATCH(R$4,$I$30:$M$30,0)+1,TRUE)+($P$1-VLOOKUP($P$1,$H$31:$H$48,1,TRUE))*(INDEX($I$31:$M$48,MATCH($P$1,$H$31:$H$48,1)+1,MATCH(R$4,$I$30:$M$30,0))-INDEX($I$31:$M$48,MATCH($P$1,$H$31:$H$48,1),MATCH(R$4,$I$30:$M$30,0)))/(INDEX($H$31:$H$48,MATCH($P$1,$H$31:$H$48,1)+1)-INDEX($H$31:$H$48,MATCH($P$1,$H$31:$H$48,1))),INDEX($I$31:$M$48,MATCH($P$1,$H$31:$H$48,0),MATCH(R4,$I$30:$M$30,0)))","v":{"$error":"#N/A"}},{"$f":"IF(ISERROR(MATCH($P$1,$H$31:$H$48,0)),VLOOKUP($P$1,$H$31:$M$48,MATCH(S$4,$I$30:$M$30,0)+1,TRUE)+($P$1-VLOOKUP($P$1,$H$31:$H$48,1,TRUE))*(INDEX($I$31:$M$48,MATCH($P$1,$H$31:$H$48,1)+1,MATCH(S$4,$I$30:$M$30,0))-INDEX($I$31:$M$48,MATCH($P$1,$H$31:$H$48,1),MATCH(S$4,$I$30:$M$30,0)))/(INDEX($H$31:$H$48,MATCH($P$1,$H$31:$H$48,1)+1)-INDEX($H$31:$H$48,MATCH($P$1,$H$31:$H$48,1))),INDEX($I$31:$M$48,MATCH($P$1,$H$31:$H$48,0),MATCH(S4,$I$30:$M$30,0)))","v":{"$error":"#N/A"}},{"$f":"IF(ISERROR(MATCH($P$1,$H$31:$H$48,0)),VLOOKUP($P$1,$H$31:$M$48,MATCH(T$4,$I$30:$M$30,0)+1,TRUE)+($P$1-VLOOKUP($P$1,$H$31:$H$48,1,TRUE))*(INDEX($I$31:$M$48,MATCH($P$1,$H$31:$H$48,1)+1,MATCH(T$4,$I$30:$M$30,0))-INDEX($I$31:$M$48,MATCH($P$1,$H$31:$H$48,1),MATCH(T$4,$I$30:$M$30,0)))/(INDEX($H$31:$H$48,MATCH($P$1,$H$31:$H$48,1)+1)-INDEX($H$31:$H$48,MATCH($P$1,$H$31:$H$48,1))),INDEX($I$31:$M$48,MATCH($P$1,$H$31:$H$48,0),MATCH(T4,$I$30:$M$30,0)))","v":{"$error":"#N/A"}}]
[0,0,0,0,0,0,null,{"$f":"A31/100","v":0},0,0,0,0,0,null,"New Separation distance",{"$f":"IF(ISERROR(MATCH($P$2,$H$31:$H$48,0)),VLOOKUP($P$2,$H$31:$M$48,MATCH(P$4,$I$30:$M$30,0)+1,TRUE)+($P$2-VLOOKUP($P$2,$H$31:$H$48,1,TRUE))*(INDEX($I$31:$M$48,MATCH($P$2,$H$31:$H$48,1)+1,MATCH(P$4,$I$30:$M$30,0))-INDEX($I$31:$M$48,MATCH($P$2,$H$31:$H$48,1),MATCH(P$4,$I$30:$M$30,0)))/(INDEX($H$31:$H$48,MATCH($P$2,$H$31:$H$48,1)+1)-INDEX($H$31:$H$48,MATCH($P$2,$H$31:$H$48,1))),INDEX($I$31:$M$48,MATCH($P$2,$H$31:$H$48,0),MATCH(P4,$I$30:$M$30,0)))","v":{"$error":"#N/A"}},{"$f":"IF(ISERROR(MATCH($P$2,$H$31:$H$48,0)),VLOOKUP($P$2,$H$31:$M$48,MATCH(Q$4,$I$30:$M$30,0)+1,TRUE)+($P$2-VLOOKUP($P$2,$H$31:$H$48,1,TRUE))*(INDEX($I$31:$M$48,MATCH($P$2,$H$31:$H$48,1)+1,MATCH(Q$4,$I$30:$M$30,0))-INDEX($I$31:$M$48,MATCH($P$2,$H$31:$H$48,1),MATCH(Q$4,$I$30:$M$30,0)))/(INDEX($H$31:$H$48,MATCH($P$2,$H$31:$H$48,1)+1)-INDEX($H$31:$H$48,MATCH($P$2,$H$31:$H$48,1))),INDEX($I$31:$M$48,MATCH($P$2,$H$31:$H$48,0),MATCH(Q4,$I$30:$M$30,0)))","v":{"$error":"#N/A"}},{"$f":"IF(ISERROR(MATCH($P$2,$H$31:$H$48,0)),VLOOKUP($P$2,$H$31:$M$48,MATCH(R$4,$I$30:$M$30,0)+1,TRUE)+($P$2-VLOOKUP($P$2,$H$31:$H$48,1,TRUE))*(INDEX($I$31:$M$48,MATCH($P$2,$H$31:$H$48,1)+1,MATCH(R$4,$I$30:$M$30,0))-INDEX($I$31:$M$48,MATCH($P$2,$H$31:$H$48,1),MATCH(R$4,$I$30:$M$30,0)))/(INDEX($H$31:$H$48,MATCH($P$2,$H$31:$H$48,1)+1)-INDEX($H$31:$H$48,MATCH($P$2,$H$31:$H$48,1))),INDEX($I$31:$M$48,MATCH($P$2,$H$31:$H$48,0),MATCH(R4,$I$30:$M$30,0)))","v":{"$error":"#N/A"}},{"$f":"IF(ISERROR(MATCH($P$2,$H$31:$H$48,0)),VLOOKUP($P$2,$H$31:$M$48,MATCH(S$4,$I$30:$M$30,0)+1,TRUE)+($P$2-VLOOKUP($P$2,$H$31:$H$48,1,TRUE))*(INDEX($I$31:$M$48,MATCH($P$2,$H$31:$H$48,1)+1,MATCH(S$4,$I$30:$M$30,0))-INDEX($I$31:$M$48,MATCH($P$2,$H$31:$H$48,1),MATCH(S$4,$I$30:$M$30,0)))/(INDEX($H$31:$H$48,MATCH($P$2,$H$31:$H$48,1)+1)-INDEX($H$31:$H$48,MATCH($P$2,$H$31:$H$48,1))),INDEX($I$31:$M$48,MATCH($P$2,$H$31:$H$48,0),MATCH(S4,$I$30:$M$30,0)))","v":{"$error":"#N/A"}},{"$f":"IF(ISERROR(MATCH($P$2,$H$31:$H$48,0)),VLOOKUP($P$2,$H$31:$M$48,MATCH(T$4,$I$30:$M$30,0)+1,TRUE)+($P$2-VLOOKUP($P$2,$H$31:$H$48,1,TRUE))*(INDEX($I$31:$M$48,MATCH($P$2,$H$31:$H$48,1)+1,MATCH(T$4,$I$30:$M$30,0))-INDEX($I$31:$M$48,MATCH($P$2,$H$31:$H$48,1),MATCH(T$4,$I$30:$M$30,0)))/(INDEX($H$31:$H$48,MATCH($P$2,$H$31:$H$48,1)+1)-INDEX($H$31:$H$48,MATCH($P$2,$H$31:$H$48,1))),INDEX($I$31:$M$48,MATCH($P$2,$H$31:$H$48,0),MATCH(T4,$I$30:$M$30,0)))","v":{"$error":"#N/A"}}]
[50,551.6,321.5,184.4,150.6,114.4,null,{"$f":"A32/100","v":0.5},{"$f":"+B32/1609.347","v":0.34274771071745253},{"$f":"+C32/1609.347","v":0.19977046590946515},{"$f":"+D32/1609.347","v":0.11458063425724845},{"$f":"+E32/1609.347","v":9.3578327110312443E-2},{"$f":"+F32/1609.347","v":7.1084731881937216E-2}]
[100,829.7,476.1,263.39999999999998,215.1,160.1,null,1,0.51555071715422474,0.2958342731555097,0.16366886693795682,0.13365669429899207,9.9481342432676104E-2]
[200,1237.5,688.4,376.9,306,216.9,null,2,0.76894541699210928,0.42775113135948928,0.23419436578935429,0.19013923038350336,0.13477516036007151]
[300,1570.5,856.6,460.8,374.7,256.7,null,3,0.97586163829180406,0.53226557106702288,0.28632731163633451,0.23282735171470167,0.15950568771060561]
[400,1839.2,995.2,531,431.1,286.5,null,4,1.1428237664096059,0.61838745777013915,0.32994748801843232,0.26787262162852388,0.17802251472180952]
[500,2066.4,1122.4000000000001,594.5,480.6,310.89999999999998,null,5,1.2839990381191875,0.69742572608641895,0.36940448517317892,0.29863043830820823,0.19318394354977514]
[600,2304.1,1241.4000000000001,648.4,523.29999999999995,335.6,null,6,1.4316986951850657,0.77136876012444811,0.40289633000216857,0.32516293875714808,0.20853178338792069]
[700,2514.6,1343.1,698.8,566.70000000000005,355.8,null,7,1.562497087327966,0.83456209257543579,0.43421337971239266,0.3521303982298411,0.22108345807336766]
[800,2722.3,1445.6,746.5,602.4,374.2,null,8,1.6915556433758538,0.89825252105357012,0.46385273033099761,0.37431330844124977,0.23251666669773516]
[900,2950,1535.2,788.5,633,390.4,null,9,1.8330416001024019,0.95392727609396855,0.48995027175618433,0.39332723147960014,0.24258286124745004]
[1000,3132.6,1617.8,832.3,668.1,405.3,null,10,1.9465037682985709,1.0052524408968357,0.51716627924245051,0.41513731967064904,0.25184127475305201]
[1500,3813.7,1985.7,1013.4,806.5,469.1,null,15,2.369718898410349,1.233854476380793,0.62969639238772002,0.5011349323669787,0.29148468291797858]
[2000,4530.2,2274.6999999999998,1164,924.6,517.79999999999995,null,20,2.8149305277233561,1.4134304161874349,0.72327471949803246,0.57451873337446802,0.32174540357051645]
[2500,5156.1000000000004,2524.1999999999998,1295,1019.5,555.4,null,25,3.2038460319620321,1.5684622396537229,0.80467419394325779,0.63348674959471141,0.34510891684639794]
[3000,5722.2,2782.1,1415.7,1104,590.6,null,30,3.5556036081715128,1.7287135714050481,0.87967355703897299,0.68599251746205137,0.3669811420408402]
[3500,6244.7,3001.7,1523.1,1180.8,622.9,null,35,3.8802694509015145,1.8651664308567386,0.94640869868337896,0.73371373606810708,0.38705139413687661]
[4000,6689.5,3205.1,1629.6,1247.0999999999999,650.20000000000005,null,40,4.1566548419949214,1.9915530957587144,1.0125846072972453,0.77491056931786617,0.40401479606324803]
[]
[]
["Ainsworth, NE-AERMOD setback distances (SW) as reported in the Odor Footprint Tool"]
[]
["Setback Distances (m) for Ainsworth, SW",null,null,null,null,null,null,"Setback Distances (mi) for Ainsworth, SW"]
["x 104","Annoyance Free Percentage",null,null,null,null,null,"x 106","Annoyance Free Percentage"]
["OU/s",99,98,96,94,90,null,"OU/s",99,98,96,94,90,null,"Separation distance",{"$f":"IF(ISERROR(MATCH($P$1,$H$56:$H$73,0)),VLOOKUP($P$1,$H$56:$M$73,MATCH(P$4,$I$55:$M$55,0)+1,TRUE)+($P$1-VLOOKUP($P$1,$H$56:$H$73,1,TRUE))*(INDEX($I$56:$M$73,MATCH($P$1,$H$56:$H$73,1)+1,MATCH(P$4,$I$55:$M$55,0))-INDEX($I$56:$M$73,MATCH($P$1,$H$56:$H$73,1),MATCH(P$4,$I$55:$M$55,0)))/(INDEX($H$56:$H$73,MATCH($P$1,$H$56:$H$73,1)+1)-INDEX($H$56:$H$73,MATCH($P$1,$H$56:$H$73,1))),INDEX($I$56:$M$73,MATCH($P$1,$H$56:$H$73,0),MATCH(P$4,$I$55:$M$55,0)))","v":{"$error":"#N/A"}},{"$f":"IF(ISERROR(MATCH($P$1,$H$56:$H$73,0)),VLOOKUP($P$1,$H$56:$M$73,MATCH(Q$4,$I$55:$M$55,0)+1,TRUE)+($P$1-VLOOKUP($P$1,$H$56:$H$73,1,TRUE))*(INDEX($I$56:$M$73,MATCH($P$1,$H$56:$H$73,1)+1,MATCH(Q$4,$I$55:$M$55,0))-INDEX($I$56:$M$73,MATCH($P$1,$H$56:$H$73,1),MATCH(Q$4,$I$55:$M$55,0)))/(INDEX($H$56:$H$73,MATCH($P$1,$H$56:$H$73,1)+1)-INDEX($H$56:$H$73,MATCH($P$1,$H$56:$H$73,1))),INDEX($I$56:$M$73,MATCH($P$1,$H$56:$H$73,0),MATCH(Q$4,$I$55:$M$55,0)))","v":{"$error":"#N/A"}},{"$f":"IF(ISERROR(MATCH($P$1,$H$56:$H$73,0)),VLOOKUP($P$1,$H$56:$M$73,MATCH(R$4,$I$55:$M$55,0)+1,TRUE)+($P$1-VLOOKUP($P$1,$H$56:$H$73,1,TRUE))*(INDEX($I$56:$M$73,MATCH($P$1,$H$56:$H$73,1)+1,MATCH(R$4,$I$55:$M$55,0))-INDEX($I$56:$M$73,MATCH($P$1,$H$56:$H$73,1),MATCH(R$4,$I$55:$M$55,0)))/(INDEX($H$56:$H$73,MATCH($P$1,$H$56:$H$73,1)+1)-INDEX($H$56:$H$73,MATCH($P$1,$H$56:$H$73,1))),INDEX($I$56:$M$73,MATCH($P$1,$H$56:$H$73,0),MATCH(R$4,$I$55:$M$55,0)))","v":{"$error":"#N/A"}},{"$f":"IF(ISERROR(MATCH($P$1,$H$56:$H$73,0)),VLOOKUP($P$1,$H$56:$M$73,MATCH(S$4,$I$55:$M$55,0)+1,TRUE)+($P$1-VLOOKUP($P$1,$H$56:$H$73,1,TRUE))*(INDEX($I$56:$M$73,MATCH($P$1,$H$56:$H$73,1)+1,MATCH(S$4,$I$55:$M$55,0))-INDEX($I$56:$M$73,MATCH($P$1,$H$56:$H$73,1),MATCH(S$4,$I$55:$M$55,0)))/(INDEX($H$56:$H$73,MATCH($P$1,$H$56:$H$73,1)+1)-INDEX($H$56:$H$73,MATCH($P$1,$H$56:$H$73,1))),INDEX($I$56:$M$73,MATCH($P$1,$H$56:$H$73,0),MATCH(S$4,$I$55:$M$55,0)))","v":{"$error":"#N/A"}},{"$f":"IF(ISERROR(MATCH($P$1,$H$56:$H$73,0)),VLOOKUP($P$1,$H$56:$M$73,MATCH(T$4,$I$55:$M$55,0)+1,TRUE)+($P$1-VLOOKUP($P$1,$H$56:$H$73,1,TRUE))*(INDEX($I$56:$M$73,MATCH($P$1,$H$56:$H$73,1)+1,MATCH(T$4,$I$55:$M$55,0))-INDEX($I$56:$M$73,MATCH($P$1,$H$56:$H$73,1),MATCH(T$4,$I$55:$M$55,0)))/(INDEX($H$56:$H$73,MATCH($P$1,$H$56:$H$73,1)+1)-INDEX($H$56:$H$73,MATCH($P$1,$H$56:$H$73,1))),INDEX($I$56:$M$73,MATCH($P$1,$H$56:$H$73,0),MATCH(T$4,$I$55:$M$55,0)))","v":{"$error":"#N/A"}}]
[0,0,0,0,0,0,null,{"$f":"A56/100","v":0},0,0,0,0,0,null,"New Separation distance",{"$f":"IF(ISERROR(MATCH($P$2,$H$56:$H$73,0)),VLOOKUP($P$2,$H$56:$M$73,MATCH(P$4,$I$55:$M$55,0)+1,TRUE)+($P$2-VLOOKUP($P$2,$H$56:$H$73,1,TRUE))*(INDEX($I$56:$M$73,MATCH($P$2,$H$56:$H$73,1)+1,MATCH(P$4,$I$55:$M$55,0))-INDEX($I$56:$M$73,MATCH($P$2,$H$56:$H$73,1),MATCH(P$4,$I$55:$M$55,0)))/(INDEX($H$56:$H$73,MATCH($P$2,$H$56:$H$73,1)+1)-INDEX($H$56:$H$73,MATCH($P$2,$H$56:$H$73,1))),INDEX($I$56:$M$73,MATCH($P$2,$H$56:$H$73,0),MATCH(P4,$I$55:$M$55,0)))","v":{"$error":"#N/A"}},{"$f":"IF(ISERROR(MATCH($P$2,$H$56:$H$73,0)),VLOOKUP($P$2,$H$56:$M$73,MATCH(Q$4,$I$55:$M$55,0)+1,TRUE)+($P$2-VLOOKUP($P$2,$H$56:$H$73,1,TRUE))*(INDEX($I$56:$M$73,MATCH($P$2,$H$56:$H$73,1)+1,MATCH(Q$4,$I$55:$M$55,0))-INDEX($I$56:$M$73,MATCH($P$2,$H$56:$H$73,1),MATCH(Q$4,$I$55:$M$55,0)))/(INDEX($H$56:$H$73,MATCH($P$2,$H$56:$H$73,1)+1)-INDEX($H$56:$H$73,MATCH($P$2,$H$56:$H$73,1))),INDEX($I$56:$M$73,MATCH($P$2,$H$56:$H$73,0),MATCH(Q4,$I$55:$M$55,0)))","v":{"$error":"#N/A"}},{"$f":"IF(ISERROR(MATCH($P$2,$H$56:$H$73,0)),VLOOKUP($P$2,$H$56:$M$73,MATCH(R$4,$I$55:$M$55,0)+1,TRUE)+($P$2-VLOOKUP($P$2,$H$56:$H$73,1,TRUE))*(INDEX($I$56:$M$73,MATCH($P$2,$H$56:$H$73,1)+1,MATCH(R$4,$I$55:$M$55,0))-INDEX($I$56:$M$73,MATCH($P$2,$H$56:$H$73,1),MATCH(R$4,$I$55:$M$55,0)))/(INDEX($H$56:$H$73,MATCH($P$2,$H$56:$H$73,1)+1)-INDEX($H$56:$H$73,MATCH($P$2,$H$56:$H$73,1))),INDEX($I$56:$M$73,MATCH($P$2,$H$56:$H$73,0),MATCH(R4,$I$55:$M$55,0)))","v":{"$error":"#N/A"}},{"$f":"IF(ISERROR(MATCH($P$2,$H$56:$H$73,0)),VLOOKUP($P$2,$H$56:$M$73,MATCH(S$4,$I$55:$M$55,0)+1,TRUE)+($P$2-VLOOKUP($P$2,$H$56:$H$73,1,TRUE))*(INDEX($I$56:$M$73,MATCH($P$2,$H$56:$H$73,1)+1,MATCH(S$4,$I$55:$M$55,0))-INDEX($I$56:$M$73,MATCH($P$2,$H$56:$H$73,1),MATCH(S$4,$I$55:$M$55,0)))/(INDEX($H$56:$H$73,MATCH($P$2,$H$56:$H$73,1)+1)-INDEX($H$56:$H$73,MATCH($P$2,$H$56:$H$73,1))),INDEX($I$56:$M$73,MATCH($P$2,$H$56:$H$73,0),MATCH(S4,$I$55:$M$55,0)))","v":{"$error":"#N/A"}},{"$f":"IF(ISERROR(MATCH($P$2,$H$56:$H$73,0)),VLOOKUP($P$2,$H$56:$M$73,MATCH(T$4,$I$55:$M$55,0)+1,TRUE)+($P$2-VLOOKUP($P$2,$H$56:$H$73,1,TRUE))*(INDEX($I$56:$M$73,MATCH($P$2,$H$56:$H$73,1)+1,MATCH(T$4,$I$55:$M$55,0))-INDEX($I$56:$M$73,MATCH($P$2,$H$56:$H$73,1),MATCH(T$4,$I$55:$M$55,0)))/(INDEX($H$56:$H$73,MATCH($P$2,$H$56:$H$73,1)+1)-INDEX($H$56:$H$73,MATCH($P$2,$H$56:$H$73,1))),INDEX($I$56:$M$73,MATCH($P$2,$H$56:$H$73,0),MATCH(T4,$I$55:$M$55,0)))","v":{"$error":"#N/A"}}]
[50,424.8,267.5,181,150.6,114.4,null,{"$f":"A57/100","v":0.5},{"$f":"+B57/1609.347","v":0.26395799041474588},{"$f":"+C57/1609.347","v":0.1662164840770822},{"$f":"+D57/1609.347","v":0.11246797614187617},{"$f":"+E57/1609.347","v":9.3578327110312443E-2},{"$f":"+F57/1609.347","v":7.1084731881937216E-2}]
[100,623.9,386.9,258.60000000000002,213.3,157.6,null,1,{"$f":"+B58/1609.347","v":0.38767276417080965},{"$f":"+C58/1609.347","v":0.24040806612868448},{"$f":"+D58/1609.347","v":0.16068629077507834},{"$f":"+E58/1609.347","v":0.13253822823791264},{"$f":"+F58/1609.347","v":9.7927917347843563E-2}]
[200,936,556.5,367.5,301.8,214.1,null,2,0.58160235176130448,0.34579242388372428,0.22835348747038395,0.1875294762409847,0.13303532426505907]
[300,1172.9000000000001,695.2,449.6,368.2,254.6,null,3,0.72880491280003634,0.43197644759023385,0.27936796725628471,0.22878844649413707,0.15820081063934627]
[400,1377.2,801.7,519,423.1,286.5,null,4,0.85575081073255177,0.4981523562041002,0.32249104761123609,0.26290166135705972,0.17802251472180952]
[500,1563.7,907.7,579,469.9,310.7,null,5,0.97163632206105954,0.56401757980100009,0.35977324964721719,0.29198177894512495,0.19305966954298856]
[600,1725.9,993.6,633.1,511.8,335.6,null,6,1.0724225415649951,0.6173932657158463,0.39338936848299344,0.31801718336691842,0.20853178338792069]
[700,1883.1,1078.3,683.4,549.9,355.8,null,7,1.1701019108992654,0.67002330758997286,0.42464428118982417,0.34169138165976637,0.22108345807336766]
[800,2049.4,1157,729.6,587.4,374.2,null,8,1.2734357475423261,0.71892512926050134,0.45335157675752963,0.3649927579322545,0.23251666669773516]
[900,2184.6,1229.5999999999999,775,620.1,390.4,null,9,1.3574449761300702,0.76403659372403832,0.48156177629808861,0.38531155804186418,0.24258286124745004]
[1000,2297.8000000000002,1290.9000000000001,815.7,650.20000000000005,405.3,null,10,1.4277840639712878,0.80212657680413246,0.5068515366791625,0.40401479606324803,0.25184127475305201]
[1500,2957.4,1587.7,986.9,778.2,469.1,null,15,1.8376397383535061,0.986549202875452,0.61323008648849497,0.48355016040667431,0.29148468291797858]
[2000,3482.4,1832.1,1139.0999999999999,886.2,517.79999999999995,null,20,2.1638590061683405,1.1384120391686814,0.70780260565310027,0.55065812407144021,0.32174540357051645]
[2500,3929.8,2050.8000000000002,1259.8,972.3,555.4,null,25,2.4418599593499724,1.2743056655898326,0.78280196874881547,0.60415808399307291,0.34510891684639794]
[3000,4367.8,2258.1999999999998,1379.5,1051.7,590.6,null,30,2.7140200342126342,1.4031778106275401,0.85717996181059775,0.65349486468735463,0.3669811420408402]
[3500,4806.7,2444.3000000000002,1481.5,1124.7,622.9,null,35,2.9867393421058352,1.5188147739424749,0.92055970527176556,0.69885487716446493,0.38705139413687661]
[4000,5109.8999999999996,2619.6999999999998,1580.2,1186.4000000000001,650.20000000000005,null,40,3.1751387363943264,1.627803077894326,0.98188892762095437,0.73719340825813207,0.40401479606324803]
[]
[]
["Ainsworth, NE-AERMOD setback distances (NW) as reported in the Odor Footprint Tool"]
[]
["Setback Distances (m) for Ainsworth, NW",null,null,null,null,null,null,"Setback Distances (mi) for Ainsworth, NW"]
["x 104","Annoyance Free Percentage",null,null,null,null,null,"x 106","Annoyance Free Percentage"]
["OU/s",99,98,96,94,90,null,"OU/s",99,98,96,94,90,null,"Separation distance",{"$f":"IF(ISERROR(MATCH($P$1,$H$81:$H$98,0)),VLOOKUP($P$1,$H$81:$M$98,MATCH(P$4,$I$80:$M$80,0)+1,TRUE)+($P$1-VLOOKUP($P$1,$H$81:$H$98,1,TRUE))*(INDEX($I$81:$M$98,MATCH($P$1,$H$81:$H$98,1)+1,MATCH(P$4,$I$80:$M$80,0))-INDEX($I$81:$M$98,MATCH($P$1,$H$81:$H$98,1),MATCH(P$4,$I$80:$M$80,0)))/(INDEX($H$81:$H$98,MATCH($P$1,$H$81:$H$98,1)+1)-INDEX($H$81:$H$98,MATCH($P$1,$H$81:$H$98,1))),INDEX($I$81:$M$98,MATCH($P$1,$H$81:$H$98,0),MATCH(P4,$I$80:$M$80,0)))","v":{"$error":"#N/A"}},{"$f":"IF(ISERROR(MATCH($P$1,$H$81:$H$98,0)),VLOOKUP($P$1,$H$81:$M$98,MATCH(Q$4,$I$80:$M$80,0)+1,TRUE)+($P$1-VLOOKUP($P$1,$H$81:$H$98,1,TRUE))*(INDEX($I$81:$M$98,MATCH($P$1,$H$81:$H$98,1)+1,MATCH(Q$4,$I$80:$M$80,0))-INDEX($I$81:$M$98,MATCH($P$1,$H$81:$H$98,1),MATCH(Q$4,$I$80:$M$80,0)))/(INDEX($H$81:$H$98,MATCH($P$1,$H$81:$H$98,1)+1)-INDEX($H$81:$H$98,MATCH($P$1,$H$81:$H$98,1))),INDEX($I$81:$M$98,MATCH($P$1,$H$81:$H$98,0),MATCH(Q4,$I$80:$M$80,0)))","v":{"$error":"#N/A"}},{"$f":"IF(ISERROR(MATCH($P$1,$H$81:$H$98,0)),VLOOKUP($P$1,$H$81:$M$98,MATCH(R$4,$I$80:$M$80,0)+1,TRUE)+($P$1-VLOOKUP($P$1,$H$81:$H$98,1,TRUE))*(INDEX($I$81:$M$98,MATCH($P$1,$H$81:$H$98,1)+1,MATCH(R$4,$I$80:$M$80,0))-INDEX($I$81:$M$98,MATCH($P$1,$H$81:$H$98,1),MATCH(R$4,$I$80:$M$80,0)))/(INDEX($H$81:$H$98,MATCH($P$1,$H$81:$H$98,1)+1)-INDEX($H$81:$H$98,MATCH($P$1,$H$81:$H$98,1))),INDEX($I$81:$M$98,MATCH($P$1,$H$81:$H$98,0),MATCH(R4,$I$80:$M$80,0)))","v":{"$error":"#N/A"}},{"$f":"IF(ISERROR(MATCH($P$1,$H$81:$H$98,0)),VLOOKUP($P$1,$H$81:$M$98,MATCH(S$4,$I$80:$M$80,0)+1,TRUE)+($P$1-VLOOKUP($P$1,$H$81:$H$98,1,TRUE))*(INDEX($I$81:$M$98,MATCH($P$1,$H$81:$H$98,1)+1,MATCH(S$4,$I$80:$M$80,0))-INDEX($I$81:$M$98,MATCH($P$1,$H$81:$H$98,1),MATCH(S$4,$I$80:$M$80,0)))/(INDEX($H$81:$H$98,MATCH($P$1,$H$81:$H$98,1)+1)-INDEX($H$81:$H$98,MATCH($P$1,$H$81:$H$98,1))),INDEX($I$81:$M$98,MATCH($P$1,$H$81:$H$98,0),MATCH(S4,$I$80:$M$80,0)))","v":{"$error":"#N/A"}},{"$f":"IF(ISERROR(MATCH($P$1,$H$81:$H$98,0)),VLOOKUP($P$1,$H$81:$M$98,MATCH(T$4,$I$80:$M$80,0)+1,TRUE)+($P$1-VLOOKUP($P$1,$H$81:$H$98,1,TRUE))*(INDEX($I$81:$M$98,MATCH($P$1,$H$81:$H$98,1)+1,MATCH(T$4,$I$80:$M$80,0))-INDEX($I$81:$M$98,MATCH($P$1,$H$81:$H$98,1),MATCH(T$4,$I$80:$M$80,0)))/(INDEX($H$81:$H$98,MATCH($P$1,$H$81:$H$98,1)+1)-INDEX($H$81:$H$98,MATCH($P$1,$H$81:$H$98,1))),INDEX($I$81:$M$98,MATCH($P$1,$H$81:$H$98,0),MATCH(T4,$I$80:$M$80,0)))","v":{"$error":"#N/A"}}]
[0,0,0,0,0,0,null,{"$f":"A81/100","v":0},0,0,0,0,0,null,"New Separation distance",{"$f":"IF(ISERROR(MATCH($P$2,$H$81:$H$98,0)),VLOOKUP($P$2,$H$81:$M$98,MATCH(P$4,$I$80:$M$80,0)+1,TRUE)+($P$2-VLOOKUP($P$2,$H$81:$H$98,1,TRUE))*(INDEX($I$81:$M$98,MATCH($P$2,$H$81:$H$98,1)+1,MATCH(P$4,$I$80:$M$80,0))-INDEX($I$81:$M$98,MATCH($P$2,$H$81:$H$98,1),MATCH(P$4,$I$80:$M$80,0)))/(INDEX($H$81:$H$98,MATCH($P$2,$H$81:$H$98,1)+1)-INDEX($H$81:$H$98,MATCH($P$2,$H$81:$H$98,1))),INDEX($I$81:$M$98,MATCH($P$2,$H$81:$H$98,0),MATCH(P4,$I$80:$M$80,0)))","v":{"$error":"#N/A"}},{"$f":"IF(ISERROR(MATCH($P$2,$H$81:$H$98,0)),VLOOKUP($P$2,$H$81:$M$98,MATCH(Q$4,$I$80:$M$80,0)+1,TRUE)+($P$2-VLOOKUP($P$2,$H$81:$H$98,1,TRUE))*(INDEX($I$81:$M$98,MATCH($P$2,$H$81:$H$98,1)+1,MATCH(Q$4,$I$80:$M$80,0))-INDEX($I$81:$M$98,MATCH($P$2,$H$81:$H$98,1),MATCH(Q$4,$I$80:$M$80,0)))/(INDEX($H$81:$H$98,MATCH($P$2,$H$81:$H$98,1)+1)-INDEX($H$81:$H$98,MATCH($P$2,$H$81:$H$98,1))),INDEX($I$81:$M$98,MATCH($P$2,$H$81:$H$98,0),MATCH(Q4,$I$80:$M$80,0)))","v":{"$error":"#N/A"}},{"$f":"IF(ISERROR(MATCH($P$2,$H$81:$H$98,0)),VLOOKUP($P$2,$H$81:$M$98,MATCH(R$4,$I$80:$M$80,0)+1,TRUE)+($P$2-VLOOKUP($P$2,$H$81:$H$98,1,TRUE))*(INDEX($I$81:$M$98,MATCH($P$2,$H$81:$H$98,1)+1,MATCH(R$4,$I$80:$M$80,0))-INDEX($I$81:$M$98,MATCH($P$2,$H$81:$H$98,1),MATCH(R$4,$I$80:$M$80,0)))/(INDEX($H$81:$H$98,MATCH($P$2,$H$81:$H$98,1)+1)-INDEX($H$81:$H$98,MATCH($P$2,$H$81:$H$98,1))),INDEX($I$81:$M$98,MATCH($P$2,$H$81:$H$98,0),MATCH(R4,$I$80:$M$80,0)))","v":{"$error":"#N/A"}},{"$f":"IF(ISERROR(MATCH($P$2,$H$81:$H$98,0)),VLOOKUP($P$2,$H$81:$M$98,MATCH(S$4,$I$80:$M$80,0)+1,TRUE)+($P$2-VLOOKUP($P$2,$H$81:$H$98,1,TRUE))*(INDEX($I$81:$M$98,MATCH($P$2,$H$81:$H$98,1)+1,MATCH(S$4,$I$80:$M$80,0))-INDEX($I$81:$M$98,MATCH($P$2,$H$81:$H$98,1),MATCH(S$4,$I$80:$M$80,0)))/(INDEX($H$81:$H$98,MATCH($P$2,$H$81:$H$98,1)+1)-INDEX($H$81:$H$98,MATCH($P$2,$H$81:$H$98,1))),INDEX($I$81:$M$98,MATCH($P$2,$H$81:$H$98,0),MATCH(S4,$I$80:$M$80,0)))","v":{"$error":"#N/A"}},{"$f":"IF(ISERROR(MATCH($P$2,$H$81:$H$98,0)),VLOOKUP($P$2,$H$81:$M$98,MATCH(T$4,$I$80:$M$80,0)+1,TRUE)+($P$2-VLOOKUP($P$2,$H$81:$H$98,1,TRUE))*(INDEX($I$81:$M$98,MATCH($P$2,$H$81:$H$98,1)+1,MATCH(T$4,$I$80:$M$80,0))-INDEX($I$81:$M$98,MATCH($P$2,$H$81:$H$98,1),MATCH(T$4,$I$80:$M$80,0)))/(INDEX($H$81:$H$98,MATCH($P$2,$H$81:$H$98,1)+1)-INDEX($H$81:$H$98,MATCH($P$2,$H$81:$H$98,1))),INDEX($I$81:$M$98,MATCH($P$2,$H$81:$H$98,0),MATCH(T4,$I$80:$M$80,0)))","v":{"$error":"#N/A"}}]
[50,708.3,402.2,234.3,178.2,137.80000000000001,null,{"$f":"A82/100","v":0.5},{"$f":"+B82/1609.347","v":0.4401163950347563},{"$f":"+C82/1609.347","v":0.24991502764785967},{"$f":"+D82/1609.347","v":0.14558699895050603},{"$f":"+E82/1609.347","v":0.11072814004686372},{"$f":"+F82/1609.347","v":8.5624790675969828E-2}]
[100,1046,608.20000000000005,343.5,255.7,194.4,null,1,0.64995305549393634,0.37791725463806131,0.21344060665599154,0.15888431767667258,0.12079433459657862]
[200,1570.6,898.9,501.5,365.6,272.60000000000002,null,2,0.97592377529519736,0.55854952350238951,0.31161707201740829,0.22717288440591124,0.16938547125014061]
[300,1966.6,1124.8,621.1,447.3,331.5,null,3,1.2219863087326723,0.69891701416785812,0.38593292807579721,0.27793881617823873,0.20598416624879531]
[400,2369.6999999999998,1329.6,725.5,520.4,380.4,null,4,1.4724605694110715,0.82617359711734006,0.45080395961840425,0.32336096565874234,0.23636916090811988]
[500,2630,1523.4,812.8,580,422.3,null,5,1.6342031892438362,0.94659510969355898,0.5050495635807567,0.36039461968115016,0.2624045653299133]
[600,2852.9,1692.4,892.9,635,459.4,null,6,1.772706569807506,1.0516066454282389,0.55482130329879131,0.39456997154746615,0.28545739358882827]
[700,3100,1845.9,967.1,682.1,492.2,null,7,1.9262471051923544,1.1469869456369572,0.60092695981662125,0.42383650014571128,0.30583833070183125]
[800,3343.9,1969.1,1034.7,728.8,523.6,null,8,2.0777992564686176,1.2235397338175049,0.64293157411049329,0.45285448073038315,0.32534934976732799]
[900,3576,2100.3000000000002,1096.5,771.4,552,null,9,2.2220192413444706,1.3050634822695169,0.68133224220755373,0.47932484417592974,0.34299625873102568]
[1000,3775,2232.8000000000002,1161.4000000000001,810.3,578.70000000000005,null,10,2.3456718780971415,1.3873950117656417,0.72165915740980668,0.50349613849592412,0.35958683863703728]
[1500,4800,2777.8,1431.6,985.4,693.5,null,15,2.9825761628784844,1.7260416802591363,0.88955334057850788,0.61229803143759554,0.43092011853254769]
[2000,5803.6,3271.9,1658.4,1131.9000000000001,784.8,null,20,3.6061831289336608,2.0330606140254401,1.0304800642745164,0.70332874140878265,0.48765120263063216]
[2500,6478.5,3699,1860.2,1251.5,865.4,null,25,4.0255457648350541,2.2984477555182319,1.1558725371221994,0.77764459746717152,0.53773362736563335]
[3000,7182.8,4111.2,2048.6999999999998,1370.4,935.9,null,30,4.4631766797340786,2.5545764835054219,1.273000788518573,0.85152549450180737,0.58154021475791107]
[3500,7767.7,4465.8,2214.1999999999998,1473.2,996.5,null,35,4.8266160125815007,2.7749142975380701,1.3758375291344873,0.9154023339901215,0.61919523881425198]
[4000,8366.7000000000007,4833.3,2356.8000000000002,1572.5,1051.9000000000001,null,40,5.1988166629073786,3.0032677850084539,1.4644448959733358,0.97710437835967012,0.65361913869414123]

{"sheet":"Lincoln","index":7,"n_rows":102,"n_cols":20,"rows_kept":102,"cut":false,"hidden":true,"merged":[[55,1,55,5],[55,8,55,12],[81,1,81,5],[81,8,81,12],[3,1,3,5],[3,8,3,12],[29,1,29,5],[29,8,29,12]]}
["Lincoln, NE-AERMOD setback distances (North) as reported in the Odor Footprint Tool",null,null,null,null,null,null,null,null,null,null,null,null,null,"Total Scaled Odor Emission Rate (x10^6)",{"$f":"Inputs!E33","v":""}]
[null,null,null,null,null,null,null,null,null,null,null,null,null,null,"New Total Scaled Odor Emission Rate (x10^6)",{"$f":"Inputs!E42","v":""}]
["Setback Distances (m) for Lincoln, North",null,null,null,null,null,null,"Setback Distances (mi) for Lincoln, North"]
["x 104","Annoyance Free Percentage",null,null,null,null,null,"x 106","Annoyance Free Percentage",null,null,null,null,null,"Annoyance free percentage",99,98,96,94,90]
["OU/s",99,98,96,94,90,null,"OU/s",{"$f":"B5","v":99},{"$f":"C5","v":98},{"$f":"D5","v":96},{"$f":"E5","v":94},{"$f":"F5","v":90},null,"Separation distance",{"$f":"IF(ISERROR(MATCH($P$1,$H$6:$H$24,0)),VLOOKUP($P$1,$H$6:$M$24,MATCH(P4,$I$5:$M$5,0)+1,TRUE)+($P$1-VLOOKUP($P$1,$H$6:$H$24,1,TRUE))*(INDEX($I$6:$M$24,MATCH($P$1,$H$6:$H$24,1)+1,MATCH(P4,$I$5:$M$5,0))-INDEX($I$6:$M$24,MATCH($P$1,$H$6:$H$24,1),MATCH(P4,$I$5:$M$5,0)))/(INDEX($H$6:$H$24,MATCH($P$1,$H$6:$H$24,1)+1)-INDEX($H$6:$H$24,MATCH($P$1,$H$6:$H$24,1))),INDEX($I$6:$M$24,MATCH($P$1,$H$6:$H$24,0),MATCH(P4,$I$5:$M$5,0)))","v":{"$error":"#N/A"}},{"$f":"IF(ISERROR(MATCH($P$1,$H$6:$H$24,0)),VLOOKUP($P$1,$H$6:$M$24,MATCH(Q4,$I$5:$M$5,0)+1,TRUE)+($P$1-VLOOKUP($P$1,$H$6:$H$24,1,TRUE))*(INDEX($I$6:$M$24,MATCH($P$1,$H$6:$H$24,1)+1,MATCH(Q4,$I$5:$M$5,0))-INDEX($I$6:$M$24,MATCH($P$1,$H$6:$H$24,1),MATCH(Q4,$I$5:$M$5,0)))/(INDEX($H$6:$H$24,MATCH($P$1,$H$6:$H$24,1)+1)-INDEX($H$6:$H$24,MATCH($P$1,$H$6:$H$24,1))),INDEX($I$6:$M$24,MATCH($P$1,$H$6:$H$24,0),MATCH(Q4,$I$5:$M$5,0)))","v":{"$error":"#N/A"}},{"$f":"IF(ISERROR(MATCH($P$1,$H$6:$H$24,0)),VLOOKUP($P$1,$H$6:$M$24,MATCH(R4,$I$5:$M$5,0)+1,TRUE)+($P$1-VLOOKUP($P$1,$H$6:$H$24,1,TRUE))*(INDEX($I$6:$M$24,MATCH($P$1,$H$6:$H$24,1)+1,MATCH(R4,$I$5:$M$5,0))-INDEX($I$6:$M$24,MATCH($P$1,$H$6:$H$24,1),MATCH(R4,$I$5:$M$5,0)))/(INDEX($H$6:$H$24,MATCH($P$1,$H$6:$H$24,1)+1)-INDEX($H$6:$H$24,MATCH($P$1,$H$6:$H$24,1))),INDEX($I$6:$M$24,MATCH($P$1,$H$6:$H$24,0),MATCH(R4,$I$5:$M$5,0)))","v":{"$error":"#N/A"}},{"$f":"IF(ISERROR(MATCH($P$1,$H$6:$H$24,0)),VLOOKUP($P$1,$H$6:$M$24,MATCH(S4,$I$5:$M$5,0)+1,TRUE)+($P$1-VLOOKUP($P$1,$H$6:$H$24,1,TRUE))*(INDEX($I$6:$M$24,MATCH($P$1,$H$6:$H$24,1)+1,MATCH(S4,$I$5:$M$5,0))-INDEX($I$6:$M$24,MATCH($P$1,$H$6:$H$24,1),MATCH(S4,$I$5:$M$5,0)))/(INDEX($H$6:$H$24,MATCH($P$1,$H$6:$H$24,1)+1)-INDEX($H$6:$H$24,MATCH($P$1,$H$6:$H$24,1))),INDEX($I$6:$M$24,MATCH($P$1,$H$6:$H$24,0),MATCH(S4,$I$5:$M$5,0)))","v":{"$error":"#N/A"}},{"$f":"IF(ISERROR(MATCH($P$1,$H$6:$H$24,0)),VLOOKUP($P$1,$H$6:$M$24,MATCH(T4,$I$5:$M$5,0)+1,TRUE)+($P$1-VLOOKUP($P$1,$H$6:$H$24,1,TRUE))*(INDEX($I$6:$M$24,MATCH($P$1,$H$6:$H$24,1)+1,MATCH(T4,$I$5:$M$5,0))-INDEX($I$6:$M$24,MATCH($P$1,$H$6:$H$24,1),MATCH(T4,$I$5:$M$5,0)))/(INDEX($H$6:$H$24,MATCH($P$1,$H$6:$H$24,1)+1)-INDEX($H$6:$H$24,MATCH($P$1,$H$6:$H$24,1))),INDEX($I$6:$M$24,MATCH($P$1,$H$6:$H$24,0),MATCH(T4,$I$5:$M$5,0)))","v":{"$error":"#N/A"}}]
[0,0,0,0,0,0,null,{"$f":"A6/100","v":0},0,0,0,0,0,null,"New Separation distance",{"$f":"IF(ISERROR(MATCH($P$2,$H$6:$H$24,0)),VLOOKUP($P$2,$H$6:$M$24,MATCH(P4,$I$5:$M$5,0)+1,TRUE)+($P$2-VLOOKUP($P$2,$H$6:$H$24,1,TRUE))*(INDEX($I$6:$M$24,MATCH($P$2,$H$6:$H$24,1)+1,MATCH(P4,$I$5:$M$5,0))-INDEX($I$6:$M$24,MATCH($P$2,$H$6:$H$24,1),MATCH(P4,$I$5:$M$5,0)))/(INDEX($H$6:$H$24,MATCH($P$2,$H$6:$H$24,1)+1)-INDEX($H$6:$H$24,MATCH($P$2,$H$6:$H$24,1))),INDEX($I$6:$M$24,MATCH($P$2,$H$6:$H$24,0),MATCH(P4,$I$5:$M$5,0)))","v":{"$error":"#N/A"}},{"$f":"IF(ISERROR(MATCH($P$2,$H$6:$H$24,0)),VLOOKUP($P$2,$H$6:$M$24,MATCH(Q4,$I$5:$M$5,0)+1,TRUE)+($P$2-VLOOKUP($P$2,$H$6:$H$24,1,TRUE))*(INDEX($I$6:$M$24,MATCH($P$2,$H$6:$H$24,1)+1,MATCH(Q4,$I$5:$M$5,0))-INDEX($I$6:$M$24,MATCH($P$2,$H$6:$H$24,1),MATCH(Q4,$I$5:$M$5,0)))/(INDEX($H$6:$H$24,MATCH($P$2,$H$6:$H$24,1)+1)-INDEX($H$6:$H$24,MATCH($P$2,$H$6:$H$24,1))),INDEX($I$6:$M$24,MATCH($P$2,$H$6:$H$24,0),MATCH(Q4,$I$5:$M$5,0)))","v":{"$error":"#N/A"}},{"$f":"IF(ISERROR(MATCH($P$2,$H$6:$H$24,0)),VLOOKUP($P$2,$H$6:$M$24,MATCH(R4,$I$5:$M$5,0)+1,TRUE)+($P$2-VLOOKUP($P$2,$H$6:$H$24,1,TRUE))*(INDEX($I$6:$M$24,MATCH($P$2,$H$6:$H$24,1)+1,MATCH(R4,$I$5:$M$5,0))-INDEX($I$6:$M$24,MATCH($P$2,$H$6:$H$24,1),MATCH(R4,$I$5:$M$5,0)))/(INDEX($H$6:$H$24,MATCH($P$2,$H$6:$H$24,1)+1)-INDEX($H$6:$H$24,MATCH($P$2,$H$6:$H$24,1))),INDEX($I$6:$M$24,MATCH($P$2,$H$6:$H$24,0),MATCH(R4,$I$5:$M$5,0)))","v":{"$error":"#N/A"}},{"$f":"IF(ISERROR(MATCH($P$2,$H$6:$H$24,0)),VLOOKUP($P$2,$H$6:$M$24,MATCH(S4,$I$5:$M$5,0)+1,TRUE)+($P$2-VLOOKUP($P$2,$H$6:$H$24,1,TRUE))*(INDEX($I$6:$M$24,MATCH($P$2,$H$6:$H$24,1)+1,MATCH(S4,$I$5:$M$5,0))-INDEX($I$6:$M$24,MATCH($P$2,$H$6:$H$24,1),MATCH(S4,$I$5:$M$5,0)))/(INDEX($H$6:$H$24,MATCH($P$2,$H$6:$H$24,1)+1)-INDEX($H$6:$H$24,MATCH($P$2,$H$6:$H$24,1))),INDEX($I$6:$M$24,MATCH($P$2,$H$6:$H$24,0),MATCH(S4,$I$5:$M$5,0)))","v":{"$error":"#N/A"}},{"$f":"IF(ISERROR(MATCH($P$2,$H$6:$H$24,0)),VLOOKUP($P$2,$H$6:$M$24,MATCH(T4,$I$5:$M$5,0)+1,TRUE)+($P$2-VLOOKUP($P$2,$H$6:$H$24,1,TRUE))*(INDEX($I$6:$M$24,MATCH($P$2,$H$6:$H$24,1)+1,MATCH(T4,$I$5:$M$5,0))-INDEX($I$6:$M$24,MATCH($P$2,$H$6:$H$24,1),MATCH(T4,$I$5:$M$5,0)))/(INDEX($H$6:$H$24,MATCH($P$2,$H$6:$H$24,1)+1)-INDEX($H$6:$H$24,MATCH($P$2,$H$6:$H$24,1))),INDEX($I$6:$M$24,MATCH($P$2,$H$6:$H$24,0),MATCH(T4,$I$5:$M$5,0)))","v":{"$error":"#N/A"}}]
[20,450,255,155,120,90,null,{"$f":"A7/100","v":0.2},{"$f":"+B7/1609.347","v":0.27961651526985792},0.15844935865291948,9.6312355259617718E-2,7.4564404071962104E-2,5.5923303053971578E-2]
[50,770,440,255,195,145,null,0.5,0.4784549261284235,0.2734028149305277,0.15844935865291948,0.12116715661693843,9.0098654920287541E-2]
[100,1140,650,370,275,205,null,1,0.70836183868364,0.40389052205646142,0.2299069125552165,0.17087675933157984,0.12738085695626861]
[200,1610,955,535,395,295,null,2,1.0004057546321583,0.59340838240603178,0.3324329681541644,0.24544116340354194,0.18330416001024019]
[300,2020,1180,660,480,350,null,3,1.2551674685446954,0.73321664004096077,0.41010422239579158,0.29825761628784841,0.21747951187655615]
[400,2400,1400,770,570,410,null,4,1.4912880814392422,0.86991804750622459,0.4784549261284235,0.35418091934182,0.25476171391253721]
[500,2695,1565,860,635,470,null,5,1.6745922414494823,0.97244410310517249,0.53437822918239508,0.39456997154746615,0.29204391594851825]
[600,2985,1700,955,690,500,null,6,1.8547895512900574,1.0563290576861299,0.59340838240603178,0.42874532341378213,0.3106850169665088]
[700,3290,1875,1035,750,540,null,7,2.0443074116396276,1.1650688136244078,0.6431179851206732,0.46602752544976317,0.33553981832382951]
[800,3500,2000,1100,805,575,null,8,2.1747951187655614,1.2427400678660352,0.68350703732631934,0.50020287731607915,0.35728776951148511]
[900,3730,2165,1175,845,610,null,9,2.3177102265701555,1.345266123464983,0.7301097898712956,0.52505767867339981,0.37903572069914071]
[1000,3985,2300,1225,910,640,null,10,2.4761595852230749,1.4291510780459404,0.76117829156794647,0.56544673087904596,0.39767682171713126]
[1500,5085,2900,1525,1105,780,null,15,3.1596666225493943,1.8019730984057509,0.94758930174785183,0.6866138874959844,0.48466862646775372]
[2000,5910,3360,1765,1275,875,null,20,3.6722969005441337,2.087803314014939,1.096718109891776,0.79224679326459735,0.54369877969139035]
[2500,6705,3760,1985,1405,970,null,25,4.1662860775208825,2.336351327588146,1.2334195173570399,0.87302489767588964,0.60272893291502705]
[3000,7410,4140,2170,1555,1085,null,30,4.6043519514436602,2.5724719404826928,1.3483729736346481,0.96623040276584227,0.67418648681732407]
[3500,7945,4500,2345,1700,1150,null,35,{"$f":"+B23/1609.347","v":4.9367849195978248},2.7961651526985789,1.4571127295729263,1.0563290576861299,0.71457553902297022]
[4000,8470,4850,2515,1800,1215,null,40,5.2630041874126583,3.0136446645751351,1.5627456353415392,1.1184660610794317,0.75496459122861637]
[]
[]
["Lincoln, NE-AERMOD setback distances (East) as reported in the Odor Footprint Tool"]
[]
["Setback Distances (m) for Lincoln, East",null,null,null,null,null,null,"Setback Distances (mi) for Lincoln, East"]
["x 104","Annoyance Free Percentage",null,null,null,null,null,"x 106","Annoyance Free Percentage"]
["OU/s",99,98,96,94,90,null,"OU/s",99,98,96,94,90,null,"Separation distance",{"$f":"IF(ISERROR(MATCH($P$1,$H$32:$H$50,0)),VLOOKUP($P$1,$H$32:$M$50,MATCH(P$4,$I$31:$M$31,0)+1,TRUE)+($P$1-VLOOKUP($P$1,$H$32:$H$50,1,TRUE))*(INDEX($I$32:$M$50,MATCH($P$1,$H$32:$H$50,1)+1,MATCH(P$4,$I$31:$M$31,0))-INDEX($I$32:$M$50,MATCH($P$1,$H$32:$H$50,1),MATCH(P$4,$I$31:$M$31,0)))/(INDEX($H$32:$H$50,MATCH($P$1,$H$32:$H$50,1)+1)-INDEX($H$32:$H$50,MATCH($P$1,$H$32:$H$50,1))),INDEX($I$32:$M$50,MATCH($P$1,$H$32:$H$50,0),MATCH(P4,$I$31:$M$31,0)))","v":{"$error":"#N/A"}},{"$f":"IF(ISERROR(MATCH($P$1,$H$32:$H$50,0)),VLOOKUP($P$1,$H$32:$M$50,MATCH(Q$4,$I$31:$M$31,0)+1,TRUE)+($P$1-VLOOKUP($P$1,$H$32:$H$50,1,TRUE))*(INDEX($I$32:$M$50,MATCH($P$1,$H$32:$H$50,1)+1,MATCH(Q$4,$I$31:$M$31,0))-INDEX($I$32:$M$50,MATCH($P$1,$H$32:$H$50,1),MATCH(Q$4,$I$31:$M$31,0)))/(INDEX($H$32:$H$50,MATCH($P$1,$H$32:$H$50,1)+1)-INDEX($H$32:$H$50,MATCH($P$1,$H$32:$H$50,1))),INDEX($I$32:$M$50,MATCH($P$1,$H$32:$H$50,0),MATCH(Q4,$I$31:$M$31,0)))","v":{"$error":"#N/A"}},{"$f":"IF(ISERROR(MATCH($P$1,$H$32:$H$50,0)),VLOOKUP($P$1,$H$32:$M$50,MATCH(R$4,$I$31:$M$31,0)+1,TRUE)+($P$1-VLOOKUP($P$1,$H$32:$H$50,1,TRUE))*(INDEX($I$32:$M$50,MATCH($P$1,$H$32:$H$50,1)+1,MATCH(R$4,$I$31:$M$31,0))-INDEX($I$32:$M$50,MATCH($P$1,$H$32:$H$50,1),MATCH(R$4,$I$31:$M$31,0)))/(INDEX($H$32:$H$50,MATCH($P$1,$H$32:$H$50,1)+1)-INDEX($H$32:$H$50,MATCH($P$1,$H$32:$H$50,1))),INDEX($I$32:$M$50,MATCH($P$1,$H$32:$H$50,0),MATCH(R4,$I$31:$M$31,0)))","v":{"$error":"#N/A"}},{"$f":"IF(ISERROR(MATCH($P$1,$H$32:$H$50,0)),VLOOKUP($P$1,$H$32:$M$50,MATCH(S$4,$I$31:$M$31,0)+1,TRUE)+($P$1-VLOOKUP($P$1,$H$32:$H$50,1,TRUE))*(INDEX($I$32:$M$50,MATCH($P$1,$H$32:$H$50,1)+1,MATCH(S$4,$I$31:$M$31,0))-INDEX($I$32:$M$50,MATCH($P$1,$H$32:$H$50,1),MATCH(S$4,$I$31:$M$31,0)))/(INDEX($H$32:$H$50,MATCH($P$1,$H$32:$H$50,1)+1)-INDEX($H$32:$H$50,MATCH($P$1,$H$32:$H$50,1))),INDEX($I$32:$M$50,MATCH($P$1,$H$32:$H$50,0),MATCH(S4,$I$31:$M$31,0)))","v":{"$error":"#N/A"}},{"$f":"IF(ISERROR(MATCH($P$1,$H$32:$H$50,0)),VLOOKUP($P$1,$H$32:$M$50,MATCH(T$4,$I$31:$M$31,0)+1,TRUE)+($P$1-VLOOKUP($P$1,$H$32:$H$50,1,TRUE))*(INDEX($I$32:$M$50,MATCH($P$1,$H$32:$H$50,1)+1,MATCH(T$4,$I$31:$M$31,0))-INDEX($I$32:$M$50,MATCH($P$1,$H$32:$H$50,1),MATCH(T$4,$I$31:$M$31,0)))/(INDEX($H$32:$H$50,MATCH($P$1,$H$32:$H$50,1)+1)-INDEX($H$32:$H$50,MATCH($P$1,$H$32:$H$50,1))),INDEX($I$32:$M$50,MATCH($P$1,$H$32:$H$50,0),MATCH(T4,$I$31:$M$31,0)))","v":{"$error":"#N/A"}}]
[0,0,0,0,0,0,null,{"$f":"A32/100","v":0},0,0,0,0,0,null,"New Separation distance",{"$f":"IF(ISERROR(MATCH($P$2,$H$32:$H$50,0)),VLOOKUP($P$2,$H$32:$M$50,MATCH(P$4,$I$31:$M$31,0)+1,TRUE)+($P$2-VLOOKUP($P$2,$H$32:$H$50,1,TRUE))*(INDEX($I$32:$M$50,MATCH($P$2,$H$32:$H$50,1)+1,MATCH(P$4,$I$31:$M$31,0))-INDEX($I$32:$M$50,MATCH($P$2,$H$32:$H$50,1),MATCH(P$4,$I$31:$M$31,0)))/(INDEX($H$32:$H$50,MATCH($P$2,$H$32:$H$50,1)+1)-INDEX($H$32:$H$50,MATCH($P$2,$H$32:$H$50,1))),INDEX($I$32:$M$50,MATCH($P$2,$H$32:$H$50,0),MATCH(P4,$I$31:$M$31,0)))","v":{"$error":"#N/A"}},{"$f":"IF(ISERROR(MATCH($P$2,$H$32:$H$50,0)),VLOOKUP($P$2,$H$32:$M$50,MATCH(Q$4,$I$31:$M$31,0)+1,TRUE)+($P$2-VLOOKUP($P$2,$H$32:$H$50,1,TRUE))*(INDEX($I$32:$M$50,MATCH($P$2,$H$32:$H$50,1)+1,MATCH(Q$4,$I$31:$M$31,0))-INDEX($I$32:$M$50,MATCH($P$2,$H$32:$H$50,1),MATCH(Q$4,$I$31:$M$31,0)))/(INDEX($H$32:$H$50,MATCH($P$2,$H$32:$H$50,1)+1)-INDEX($H$32:$H$50,MATCH($P$2,$H$32:$H$50,1))),INDEX($I$32:$M$50,MATCH($P$2,$H$32:$H$50,0),MATCH(Q4,$I$31:$M$31,0)))","v":{"$error":"#N/A"}},{"$f":"IF(ISERROR(MATCH($P$2,$H$32:$H$50,0)),VLOOKUP($P$2,$H$32:$M$50,MATCH(R$4,$I$31:$M$31,0)+1,TRUE)+($P$2-VLOOKUP($P$2,$H$32:$H$50,1,TRUE))*(INDEX($I$32:$M$50,MATCH($P$2,$H$32:$H$50,1)+1,MATCH(R$4,$I$31:$M$31,0))-INDEX($I$32:$M$50,MATCH($P$2,$H$32:$H$50,1),MATCH(R$4,$I$31:$M$31,0)))/(INDEX($H$32:$H$50,MATCH($P$2,$H$32:$H$50,1)+1)-INDEX($H$32:$H$50,MATCH($P$2,$H$32:$H$50,1))),INDEX($I$32:$M$50,MATCH($P$2,$H$32:$H$50,0),MATCH(R4,$I$31:$M$31,0)))","v":{"$error":"#N/A"}},{"$f":"IF(ISERROR(MATCH($P$2,$H$32:$H$50,0)),VLOOKUP($P$2,$H$32:$M$50,MATCH(S$4,$I$31:$M$31,0)+1,TRUE)+($P$2-VLOOKUP($P$2,$H$32:$H$50,1,TRUE))*(INDEX($I$32:$M$50,MATCH($P$2,$H$32:$H$50,1)+1,MATCH(S$4,$I$31:$M$31,0))-INDEX($I$32:$M$50,MATCH($P$2,$H$32:$H$50,1),MATCH(S$4,$I$31:$M$31,0)))/(INDEX($H$32:$H$50,MATCH($P$2,$H$32:$H$50,1)+1)-INDEX($H$32:$H$50,MATCH($P$2,$H$32:$H$50,1))),INDEX($I$32:$M$50,MATCH($P$2,$H$32:$H$50,0),MATCH(S4,$I$31:$M$31,0)))","v":{"$error":"#N/A"}},{"$f":"IF(ISERROR(MATCH($P$2,$H$32:$H$50,0)),VLOOKUP($P$2,$H$32:$M$50,MATCH(T$4,$I$31:$M$31,0)+1,TRUE)+($P$2-VLOOKUP($P$2,$H$32:$H$50,1,TRUE))*(INDEX($I$32:$M$50,MATCH($P$2,$H$32:$H$50,1)+1,MATCH(T$4,$I$31:$M$31,0))-INDEX($I$32:$M$50,MATCH($P$2,$H$32:$H$50,1),MATCH(T$4,$I$31:$M$31,0)))/(INDEX($H$32:$H$50,MATCH($P$2,$H$32:$H$50,1)+1)-INDEX($H$32:$H$50,MATCH($P$2,$H$32:$H$50,1))),INDEX($I$32:$M$50,MATCH($P$2,$H$32:$H$50,0),MATCH(T4,$I$31:$M$31,0)))","v":{"$error":"#N/A"}}]
[20,180,110,85,60,40,null,{"$f":"A33/100","v":0.2},{"$f":"+B33/1609.347","v":0.11184660610794316},6.8350703732631926E-2,5.2816452884306496E-2,3.7282202035981052E-2,2.4854801357320704E-2]
[50,290,185,130,90,50,null,0.5,0.18019730984057508,0.11495345627760825,8.0778104411292281E-2,5.5923303053971578E-2,3.1068501696650878E-2]
[100,415,255,170,135,58,null,1,0.25786856408220227,0.15844935865291948,0.10563290576861299,8.3884954580957377E-2,3.6039461968115021E-2]
[200,610,375,255,165,68,null,2,0.37903572069914071,0.23301376272488158,0.15844935865291948,0.1025260555989479,4.2253162307445191E-2]
[300,745,460,305,175,80,null,3,0.46292067528009806,0.28583021560918809,0.18951786034957036,0.10873975593827807,4.9709602714641407E-2]
[400,860,535,340,190,90,null,4,0.53437822918239508,0.3324329681541644,0.21126581153722598,0.11806030644727333,5.5923303053971578E-2]
[500,960,585,380,200,100,null,5,0.59651523257569683,0.36350146985081527,0.23612061289454667,0.12427400678660351,6.2137003393301755E-2]
[600,1065,640,400,215,110,null,6,0.66175908613866374,0.39767682171713126,0.24854801357320702,0.13359455729559877,6.8350703732631926E-2]
[700,1140,680,430,235,120,null,7,0.70836183868364,0.42253162307445197,0.26718911459119754,0.14602195797425913,7.4564404071962104E-2]
[800,1215,730,450,250,130,null,8,0.75496459122861637,0.45360012477110284,0.27961651526985792,0.1553425084832544,8.0778104411292281E-2]
[900,1295,770,460,260,135,null,9,0.80467419394325779,0.4784549261284235,0.28583021560918809,0.16155620882258456,8.3884954580957377E-2]
[1000,1380,805,480,270,145,null,10,0.85749064682756426,0.50020287731607915,0.29825761628784841,0.16776990916191475,9.0098654920287541E-2]
[1500,1675,985,540,340,150,null,15,1.0407948068378043,0.61204948342402232,0.33553981832382951,0.21126581153722598,9.3205505089952637E-2]
[2000,1970,1135,595,415,155,null,20,1.2240989668480446,0.70525498851397495,0.36971517019014544,0.25786856408220227,9.6312355259617718E-2]
[2500,2190,1265,670,455,160,null,25,1.3608003743133084,0.78603309292526724,0.41631792273512175,0.28272336543952298,9.9419205429282814E-2]
[3000,2380,1385,740,505,165,null,30,1.4788606807605817,0.86059749699722932,0.45981382511043301,0.31379186713617385,0.1025260555989479]
[3500,2580,1515,810,520,170,null,35,{"$f":"+B49/1609.347","v":1.6031346875471852},0.94137560140852161,0.50330972748574421,0.32311241764516913,0.10563290576861299]
[4000,2760,1605,900,565,180,null,40,1.7149812936551285,0.99729890446249314,0.55923303053971585,0.35107406917215495,0.11184660610794316]
[]
[]
["Lincoln, NE-AERMOD setback distances (South) as reported in the Odor Footprint Tool"]
[]
["Setback Distances (m) for Lincoln, South",null,null,null,null,null,null,"Setback Distances (mi) for Lincoln, South"]
["x 104","Annoyance Free Percentage",null,null,null,null,null,"x 106","Annoyance Free Percentage"]
["OU/s",99,98,96,94,90,null,"OU/s",99,98,96,94,90,null,"Separation distance",{"$f":"IF(ISERROR(MATCH($P$1,$H$58:$H$76,0)),VLOOKUP($P$1,$H$58:$M$76,MATCH(P$4,$I$57:$M$57,0)+1,TRUE)+($P$1-VLOOKUP($P$1,$H$58:$H$76,1,TRUE))*(INDEX($I$58:$M$76,MATCH($P$1,$H$58:$H$76,1)+1,MATCH(P$4,$I$57:$M$57,0))-INDEX($I$58:$M$76,MATCH($P$1,$H$58:$H$76,1),MATCH(P$4,$I$57:$M$57,0)))/(INDEX($H$58:$H$76,MATCH($P$1,$H$58:$H$76,1)+1)-INDEX($H$58:$H$76,MATCH($P$1,$H$58:$H$76,1))),INDEX($I$58:$M$76,MATCH($P$1,$H$58:$H$76,0),MATCH(P$4,$I$57:$M$57,0)))","v":{"$error":"#N/A"}},{"$f":"IF(ISERROR(MATCH($P$1,$H$58:$H$76,0)),VLOOKUP($P$1,$H$58:$M$76,MATCH(Q$4,$I$57:$M$57,0)+1,TRUE)+($P$1-VLOOKUP($P$1,$H$58:$H$76,1,TRUE))*(INDEX($I$58:$M$76,MATCH($P$1,$H$58:$H$76,1)+1,MATCH(Q$4,$I$57:$M$57,0))-INDEX($I$58:$M$76,MATCH($P$1,$H$58:$H$76,1),MATCH(Q$4,$I$57:$M$57,0)))/(INDEX($H$58:$H$76,MATCH($P$1,$H$58:$H$76,1)+1)-INDEX($H$58:$H$76,MATCH($P$1,$H$58:$H$76,1))),INDEX($I$58:$M$76,MATCH($P$1,$H$58:$H$76,0),MATCH(Q$4,$I$57:$M$57,0)))","v":{"$error":"#N/A"}},{"$f":"IF(ISERROR(MATCH($P$1,$H$58:$H$76,0)),VLOOKUP($P$1,$H$58:$M$76,MATCH(R$4,$I$57:$M$57,0)+1,TRUE)+($P$1-VLOOKUP($P$1,$H$58:$H$76,1,TRUE))*(INDEX($I$58:$M$76,MATCH($P$1,$H$58:$H$76,1)+1,MATCH(R$4,$I$57:$M$57,0))-INDEX($I$58:$M$76,MATCH($P$1,$H$58:$H$76,1),MATCH(R$4,$I$57:$M$57,0)))/(INDEX($H$58:$H$76,MATCH($P$1,$H$58:$H$76,1)+1)-INDEX($H$58:$H$76,MATCH($P$1,$H$58:$H$76,1))),INDEX($I$58:$M$76,MATCH($P$1,$H$58:$H$76,0),MATCH(R$4,$I$57:$M$57,0)))","v":{"$error":"#N/A"}},{"$f":"IF(ISERROR(MATCH($P$1,$H$58:$H$76,0)),VLOOKUP($P$1,$H$58:$M$76,MATCH(S$4,$I$57:$M$57,0)+1,TRUE)+($P$1-VLOOKUP($P$1,$H$58:$H$76,1,TRUE))*(INDEX($I$58:$M$76,MATCH($P$1,$H$58:$H$76,1)+1,MATCH(S$4,$I$57:$M$57,0))-INDEX($I$58:$M$76,MATCH($P$1,$H$58:$H$76,1),MATCH(S$4,$I$57:$M$57,0)))/(INDEX($H$58:$H$76,MATCH($P$1,$H$58:$H$76,1)+1)-INDEX($H$58:$H$76,MATCH($P$1,$H$58:$H$76,1))),INDEX($I$58:$M$76,MATCH($P$1,$H$58:$H$76,0),MATCH(S$4,$I$57:$M$57,0)))","v":{"$error":"#N/A"}},{"$f":"IF(ISERROR(MATCH($P$1,$H$58:$H$76,0)),VLOOKUP($P$1,$H$58:$M$76,MATCH(T$4,$I$57:$M$57,0)+1,TRUE)+($P$1-VLOOKUP($P$1,$H$58:$H$76,1,TRUE))*(INDEX($I$58:$M$76,MATCH($P$1,$H$58:$H$76,1)+1,MATCH(T$4,$I$57:$M$57,0))-INDEX($I$58:$M$76,MATCH($P$1,$H$58:$H$76,1),MATCH(T$4,$I$57:$M$57,0)))/(INDEX($H$58:$H$76,MATCH($P$1,$H$58:$H$76,1)+1)-INDEX($H$58:$H$76,MATCH($P$1,$H$58:$H$76,1))),INDEX($I$58:$M$76,MATCH($P$1,$H$58:$H$76,0),MATCH(T$4,$I$57:$M$57,0)))","v":{"$error":"#N/A"}}]
[0,0,0,0,0,0,null,{"$f":"A58/100","v":0},0,0,0,0,0,null,"New Separation distance",{"$f":"IF(ISERROR(MATCH($P$2,$H$58:$H$76,0)),VLOOKUP($P$2,$H$58:$M$76,MATCH(P$4,$I$57:$M$57,0)+1,TRUE)+($P$2-VLOOKUP($P$2,$H$58:$H$76,1,TRUE))*(INDEX($I$58:$M$76,MATCH($P$2,$H$58:$H$76,1)+1,MATCH(P$4,$I$57:$M$57,0))-INDEX($I$58:$M$76,MATCH($P$2,$H$58:$H$76,1),MATCH(P$4,$I$57:$M$57,0)))/(INDEX($H$58:$H$76,MATCH($P$2,$H$58:$H$76,1)+1)-INDEX($H$58:$H$76,MATCH($P$2,$H$58:$H$76,1))),INDEX($I$58:$M$76,MATCH($P$2,$H$58:$H$76,0),MATCH(P4,$I$57:$M$57,0)))","v":{"$error":"#N/A"}},{"$f":"IF(ISERROR(MATCH($P$2,$H$58:$H$76,0)),VLOOKUP($P$2,$H$58:$M$76,MATCH(Q$4,$I$57:$M$57,0)+1,TRUE)+($P$2-VLOOKUP($P$2,$H$58:$H$76,1,TRUE))*(INDEX($I$58:$M$76,MATCH($P$2,$H$58:$H$76,1)+1,MATCH(Q$4,$I$57:$M$57,0))-INDEX($I$58:$M$76,MATCH($P$2,$H$58:$H$76,1),MATCH(Q$4,$I$57:$M$57,0)))/(INDEX($H$58:$H$76,MATCH($P$2,$H$58:$H$76,1)+1)-INDEX($H$58:$H$76,MATCH($P$2,$H$58:$H$76,1))),INDEX($I$58:$M$76,MATCH($P$2,$H$58:$H$76,0),MATCH(Q4,$I$57:$M$57,0)))","v":{"$error":"#N/A"}},{"$f":"IF(ISERROR(MATCH($P$2,$H$58:$H$76,0)),VLOOKUP($P$2,$H$58:$M$76,MATCH(R$4,$I$57:$M$57,0)+1,TRUE)+($P$2-VLOOKUP($P$2,$H$58:$H$76,1,TRUE))*(INDEX($I$58:$M$76,MATCH($P$2,$H$58:$H$76,1)+1,MATCH(R$4,$I$57:$M$57,0))-INDEX($I$58:$M$76,MATCH($P$2,$H$58:$H$76,1),MATCH(R$4,$I$57:$M$57,0)))/(INDEX($H$58:$H$76,MATCH($P$2,$H$58:$H$76,1)+1)-INDEX($H$58:$H$76,MATCH($P$2,$H$58:$H$76,1))),INDEX($I$58:$M$76,MATCH($P$2,$H$58:$H$76,0),MATCH(R4,$I$57:$M$57,0)))","v":{"$error":"#N/A"}},{"$f":"IF(ISERROR(MATCH($P$2,$H$58:$H$76,0)),VLOOKUP($P$2,$H$58:$M$76,MATCH(S$4,$I$57:$M$57,0)+1,TRUE)+($P$2-VLOOKUP($P$2,$H$58:$H$76,1,TRUE))*(INDEX($I$58:$M$76,MATCH($P$2,$H$58:$H$76,1)+1,MATCH(S$4,$I$57:$M$57,0))-INDEX($I$58:$M$76,MATCH($P$2,$H$58:$H$76,1),MATCH(S$4,$I$57:$M$57,0)))/(INDEX($H$58:$H$76,MATCH($P$2,$H$58:$H$76,1)+1)-INDEX($H$58:$H$76,MATCH($P$2,$H$58:$H$76,1))),INDEX($I$58:$M$76,MATCH($P$2,$H$58:$H$76,0),MATCH(S4,$I$57:$M$57,0)))","v":{"$error":"#N/A"}},{"$f":"IF(ISERROR(MATCH($P$2,$H$58:$H$76,0)),VLOOKUP($P$2,$H$58:$M$76,MATCH(T$4,$I$57:$M$57,0)+1,TRUE)+($P$2-VLOOKUP($P$2,$H$58:$H$76,1,TRUE))*(INDEX($I$58:$M$76,MATCH($P$2,$H$58:$H$76,1)+1,MATCH(T$4,$I$57:$M$57,0))-INDEX($I$58:$M$76,MATCH($P$2,$H$58:$H$76,1),MATCH(T$4,$I$57:$M$57,0)))/(INDEX($H$58:$H$76,MATCH($P$2,$H$58:$H$76,1)+1)-INDEX($H$58:$H$76,MATCH($P$2,$H$58:$H$76,1))),INDEX($I$58:$M$76,MATCH($P$2,$H$58:$H$76,0),MATCH(T4,$I$57:$M$57,0)))","v":{"$error":"#N/A"}}]
[20,410,230,135,105,75,null,{"$f":"A59/100","v":0.2},{"$f":"+B59/1609.347","v":0.25476171391253721},0.14291510780459404,8.3884954580957377E-2,6.5243853562966844E-2,4.6602752544976318E-2]
[50,710,380,220,170,120,null,0.5,0.44117272409244246,0.23612061289454667,0.13670140746526385,0.10563290576861299,7.4564404071962104E-2]
[100,1030,550,315,240,165,null,1,0.64001113495100814,0.34175351866315967,0.19573156068890052,0.14912880814392421,0.1025260555989479]
[200,1480,805,455,340,230,null,2,0.91962765022086601,0.50020287731607915,0.28272336543952298,0.21126581153722598,0.14291510780459404]
[300,1870,1030,555,415,275,null,3,1.1619619634547429,0.64001113495100814,0.34486036883282473,0.25786856408220227,0.17087675933157984]
[400,2210,1195,645,485,320,null,4,1.3732277749919688,0.74253719054995604,0.40078367188679631,0.30136446645751352,0.19883841085856563]
[500,2535,1355,740,540,340,null,5,1.5751730360201994,0.84195639597923877,0.45981382511043301,0.33553981832382951,0.21126581153722598]
[600,2810,1505,790,595,380,null,6,1.7460497953517793,0.93516190106919139,0.49088232680708388,0.36971517019014544,0.23612061289454667]
[700,3070,1635,870,640,400,null,7,1.9076060041743639,1.0159400054804837,0.5405919295217253,0.39767682171713126,0.24854801357320702]
[800,3290,1750,930,675,405,null,8,2.0443074116396276,1.0873975593827807,0.57787413155770628,0.41942477290478686,0.2516548637428721]
[900,3565,1890,990,710,450,null,9,2.2151841709712077,1.1743893641334031,0.61515633359368738,0.44117272409244246,0.27961651526985792]
[1000,3800,1945,1040,750,455,null,10,2.3612061289454669,1.2085647159997193,0.64622483529033825,0.46602752544976317,0.28272336543952298]
[1500,4720,2485,1280,915,545,null,15,2.9328665601638431,1.5441045343235487,0.79535364343426251,0.56855358104871112,0.33864666849349456]
[2000,5540,2920,1480,1065,605,null,20,3.4423899879889173,1.8144004990844114,0.91962765022086601,0.66175908613866374,0.3759288705294756]
[2500,6300,3230,1640,1160,665,null,25,3.9146312137780108,2.0070252096036469,1.0190468556501489,0.72078923936230033,0.41321107256545669]
[3000,6900,3585,1835,1285,715,null,30,4.2874532341378213,2.2276115716498679,1.1402140122670872,0.79846049360392757,0.44427957426210757]
[3500,7595,3940,1980,1375,745,null,35,{"$f":"+B75/1609.347","v":4.7193054077212686},2.4481979336960893,1.2303126671873748,0.8543837966578991,0.46292067528009806]
[4000,8170,4220,2110,1415,770,null,40,5.0765931772327537,2.6221815431973341,1.311090771598667,0.87923859801521986,0.4784549261284235]
[]
[]
["Lincoln, NE-AERMOD setback distances (West) as reported in the Odor Footprint Tool"]
[]
["Setback Distances (m) for Lincoln, West",null,null,null,null,null,null,"Setback Distances (m) for Lincoln, West"]
["x 104","Annoyance Free Percentage",null,null,null,null,null,"x 106","Annoyance Free Percentage"]
["OU/s",99,98,96,94,90,null,"OU/s",99,98,96,94,90,null,"Separation distance",{"$f":"IF(ISERROR(MATCH($P$1,$H$84:$H$102,0)),VLOOKUP($P$1,$H$84:$M$102,MATCH(P$4,$I$83:$M$83,0)+1,TRUE)+($P$1-VLOOKUP($P$1,$H$84:$H$102,1,TRUE))*(INDEX($I$84:$M$102,MATCH($P$1,$H$84:$H$102,1)+1,MATCH(P$4,$I$83:$M$83,0))-INDEX($I$84:$M$102,MATCH($P$1,$H$84:$H$102,1),MATCH(P$4,$I$83:$M$83,0)))/(INDEX($H$84:$H$102,MATCH($P$1,$H$84:$H$102,1)+1)-INDEX($H$84:$H$102,MATCH($P$1,$H$84:$H$102,1))),INDEX($I$84:$M$102,MATCH($P$1,$H$84:$H$102,0),MATCH(P4,$I$83:$M$83,0)))","v":{"$error":"#N/A"}},{"$f":"IF(ISERROR(MATCH($P$1,$H$84:$H$102,0)),VLOOKUP($P$1,$H$84:$M$102,MATCH(Q$4,$I$83:$M$83,0)+1,TRUE)+($P$1-VLOOKUP($P$1,$H$84:$H$102,1,TRUE))*(INDEX($I$84:$M$102,MATCH($P$1,$H$84:$H$102,1)+1,MATCH(Q$4,$I$83:$M$83,0))-INDEX($I$84:$M$102,MATCH($P$1,$H$84:$H$102,1),MATCH(Q$4,$I$83:$M$83,0)))/(INDEX($H$84:$H$102,MATCH($P$1,$H$84:$H$102,1)+1)-INDEX($H$84:$H$102,MATCH($P$1,$H$84:$H$102,1))),INDEX($I$84:$M$102,MATCH($P$1,$H$84:$H$102,0),MATCH(Q4,$I$83:$M$83,0)))","v":{"$error":"#N/A"}},{"$f":"IF(ISERROR(MATCH($P$1,$H$84:$H$102,0)),VLOOKUP($P$1,$H$84:$M$102,MATCH(R$4,$I$83:$M$83,0)+1,TRUE)+($P$1-VLOOKUP($P$1,$H$84:$H$102,1,TRUE))*(INDEX($I$84:$M$102,MATCH($P$1,$H$84:$H$102,1)+1,MATCH(R$4,$I$83:$M$83,0))-INDEX($I$84:$M$102,MATCH($P$1,$H$84:$H$102,1),MATCH(R$4,$I$83:$M$83,0)))/(INDEX($H$84:$H$102,MATCH($P$1,$H$84:$H$102,1)+1)-INDEX($H$84:$H$102,MATCH($P$1,$H$84:$H$102,1))),INDEX($I$84:$M$102,MATCH($P$1,$H$84:$H$102,0),MATCH(R4,$I$83:$M$83,0)))","v":{"$error":"#N/A"}},{"$f":"IF(ISERROR(MATCH($P$1,$H$84:$H$102,0)),VLOOKUP($P$1,$H$84:$M$102,MATCH(S$4,$I$83:$M$83,0)+1,TRUE)+($P$1-VLOOKUP($P$1,$H$84:$H$102,1,TRUE))*(INDEX($I$84:$M$102,MATCH($P$1,$H$84:$H$102,1)+1,MATCH(S$4,$I$83:$M$83,0))-INDEX($I$84:$M$102,MATCH($P$1,$H$84:$H$102,1),MATCH(S$4,$I$83:$M$83,0)))/(INDEX($H$84:$H$102,MATCH($P$1,$H$84:$H$102,1)+1)-INDEX($H$84:$H$102,MATCH($P$1,$H$84:$H$102,1))),INDEX($I$84:$M$102,MATCH($P$1,$H$84:$H$102,0),MATCH(S4,$I$83:$M$83,0)))","v":{"$error":"#N/A"}},{"$f":"IF(ISERROR(MATCH($P$1,$H$84:$H$102,0)),VLOOKUP($P$1,$H$84:$M$102,MATCH(T$4,$I$83:$M$83,0)+1,TRUE)+($P$1-VLOOKUP($P$1,$H$84:$H$102,1,TRUE))*(INDEX($I$84:$M$102,MATCH($P$1,$H$84:$H$102,1)+1,MATCH(T$4,$I$83:$M$83,0))-INDEX($I$84:$M$102,MATCH($P$1,$H$84:$H$102,1),MATCH(T$4,$I$83:$M$83,0)))/(INDEX($H$84:$H$102,MATCH($P$1,$H$84:$H$102,1)+1)-INDEX($H$84:$H$102,MATCH($P$1,$H$84:$H$102,1))),INDEX($I$84:$M$102,MATCH($P$1,$H$84:$H$102,0),MATCH(T4,$I$83:$M$83,0)))","v":{"$error":"#N/A"}}]
[0,0,0,0,0,0,null,{"$f":"A84/100","v":0},0,0,0,0,0,null,"New Separation distance",{"$f":"IF(ISERROR(MATCH($P$2,$H$84:$H$102,0)),VLOOKUP($P$2,$H$84:$M$102,MATCH(P$4,$I$83:$M$83,0)+1,TRUE)+($P$2-VLOOKUP($P$2,$H$84:$H$102,1,TRUE))*(INDEX($I$84:$M$102,MATCH($P$2,$H$84:$H$102,1)+1,MATCH(P$4,$I$83:$M$83,0))-INDEX($I$84:$M$102,MATCH($P$2,$H$84:$H$102,1),MATCH(P$4,$I$83:$M$83,0)))/(INDEX($H$84:$H$102,MATCH($P$2,$H$84:$H$102,1)+1)-INDEX($H$84:$H$102,MATCH($P$2,$H$84:$H$102,1))),INDEX($I$84:$M$102,MATCH($P$2,$H$84:$H$102,0),MATCH(P4,$I$83:$M$83,0)))","v":{"$error":"#N/A"}},{"$f":"IF(ISERROR(MATCH($P$2,$H$84:$H$102,0)),VLOOKUP($P$2,$H$84:$M$102,MATCH(Q$4,$I$83:$M$83,0)+1,TRUE)+($P$2-VLOOKUP($P$2,$H$84:$H$102,1,TRUE))*(INDEX($I$84:$M$102,MATCH($P$2,$H$84:$H$102,1)+1,MATCH(Q$4,$I$83:$M$83,0))-INDEX($I$84:$M$102,MATCH($P$2,$H$84:$H$102,1),MATCH(Q$4,$I$83:$M$83,0)))/(INDEX($H$84:$H$102,MATCH($P$2,$H$84:$H$102,1)+1)-INDEX($H$84:$H$102,MATCH($P$2,$H$84:$H$102,1))),INDEX($I$84:$M$102,MATCH($P$2,$H$84:$H$102,0),MATCH(Q4,$I$83:$M$83,0)))","v":{"$error":"#N/A"}},{"$f":"IF(ISERROR(MATCH($P$2,$H$84:$H$102,0)),VLOOKUP($P$2,$H$84:$M$102,MATCH(R$4,$I$83:$M$83,0)+1,TRUE)+($P$2-VLOOKUP($P$2,$H$84:$H$102,1,TRUE))*(INDEX($I$84:$M$102,MATCH($P$2,$H$84:$H$102,1)+1,MATCH(R$4,$I$83:$M$83,0))-INDEX($I$84:$M$102,MATCH($P$2,$H$84:$H$102,1),MATCH(R$4,$I$83:$M$83,0)))/(INDEX($H$84:$H$102,MATCH($P$2,$H$84:$H$102,1)+1)-INDEX($H$84:$H$102,MATCH($P$2,$H$84:$H$102,1))),INDEX($I$84:$M$102,MATCH($P$2,$H$84:$H$102,0),MATCH(R4,$I$83:$M$83,0)))","v":{"$error":"#N/A"}},{"$f":"IF(ISERROR(MATCH($P$2,$H$84:$H$102,0)),VLOOKUP($P$2,$H$84:$M$102,MATCH(S$4,$I$83:$M$83,0)+1,TRUE)+($P$2-VLOOKUP($P$2,$H$84:$H$102,1,TRUE))*(INDEX($I$84:$M$102,MATCH($P$2,$H$84:$H$102,1)+1,MATCH(S$4,$I$83:$M$83,0))-INDEX($I$84:$M$102,MATCH($P$2,$H$84:$H$102,1),MATCH(S$4,$I$83:$M$83,0)))/(INDEX($H$84:$H$102,MATCH($P$2,$H$84:$H$102,1)+1)-INDEX($H$84:$H$102,MATCH($P$2,$H$84:$H$102,1))),INDEX($I$84:$M$102,MATCH($P$2,$H$84:$H$102,0),MATCH(S4,$I$83:$M$83,0)))","v":{"$error":"#N/A"}},{"$f":"IF(ISERROR(MATCH($P$2,$H$84:$H$102,0)),VLOOKUP($P$2,$H$84:$M$102,MATCH(T$4,$I$83:$M$83,0)+1,TRUE)+($P$2-VLOOKUP($P$2,$H$84:$H$102,1,TRUE))*(INDEX($I$84:$M$102,MATCH($P$2,$H$84:$H$102,1)+1,MATCH(T$4,$I$83:$M$83,0))-INDEX($I$84:$M$102,MATCH($P$2,$H$84:$H$102,1),MATCH(T$4,$I$83:$M$83,0)))/(INDEX($H$84:$H$102,MATCH($P$2,$H$84:$H$102,1)+1)-INDEX($H$84:$H$102,MATCH($P$2,$H$84:$H$102,1))),INDEX($I$84:$M$102,MATCH($P$2,$H$84:$H$102,0),MATCH(T4,$I$83:$M$83,0)))","v":{"$error":"#N/A"}}]
[20,195,130,95,80,60,null,{"$f":"A85/100","v":0.2},{"$f":"+B85/1609.347","v":0.12116715661693843},8.0778104411292281E-2,5.9030153223636667E-2,4.9709602714641407E-2,3.7282202035981052E-2]
[50,315,215,155,125,90,null,0.5,0.19573156068890052,0.13359455729559877,9.6312355259617718E-2,7.7671254241627199E-2,5.5923303053971578E-2]
[100,475,310,220,160,135,null,1,0.29515076611818336,0.19262471051923544,0.13670140746526385,9.9419205429282814E-2,8.3884954580957377E-2]
[200,695,450,285,200,150,null,2,0.43185217358344719,0.27961651526985792,0.17709045967091,0.12427400678660351,9.3205505089952637E-2]
[300,850,530,350,235,165,null,3,0.52816452884306497,0.32932611798449929,0.21747951187655615,0.14602195797425913,0.1025260555989479]
[400,1000,610,400,285,175,null,4,0.6213700339330176,0.37903572069914071,0.24854801357320702,0.17709045967091,0.10873975593827807]
[500,1155,665,460,325,195,null,5,0.71768238919263527,0.41321107256545669,0.28583021560918809,0.20194526102823071,0.12116715661693843]
[600,1275,755,500,370,220,null,6,0.79224679326459735,0.46913437561942828,0.3106850169665088,0.2299069125552165,0.13670140746526385]
[700,1400,820,550,400,230,null,7,0.86991804750622459,0.50952342782507443,0.34175351866315967,0.24854801357320702,0.14291510780459404]
[800,1510,880,590,435,240,null,8,0.93826875123885656,0.54680562986105541,0.36660832002048038,0.27029596476086265,0.14912880814392421]
[900,1610,940,640,470,250,null,9,1.0004057546321583,0.5840878318970365,0.39767682171713126,0.29204391594851825,0.1553425084832544]
[1000,1710,990,680,500,260,null,10,1.0625427580254601,0.61515633359368738,0.42253162307445197,0.3106850169665088,0.16155620882258456]
[1500,2070,1210,830,595,295,null,15,1.2862359702413464,0.7518577410589512,0.51573712816440453,0.36971517019014544,0.18330416001024019]
[2000,2400,1460,975,655,340,null,20,1.4912880814392422,0.90720024954220568,0.6058357830846921,0.40699737222612647,0.21126581153722598]
[2500,2740,1640,1080,710,370,null,25,1.7025538929764681,1.0190468556501489,0.67107963664765902,0.44117272409244246,0.2299069125552165]
[3000,3060,1815,1160,765,410,null,30,1.9013923038350338,1.127786611588427,0.72078923936230033,0.47534807595875844,0.25476171391253721]
[3500,3400,1930,1255,785,460,null,35,{"$f":"+B101/1609.347","v":2.1126581153722599},1.199244165490724,0.77981939258593702,0.48777547663741877,0.28583021560918809]
[4000,3695,2050,1310,830,515,null,40,2.2959622753824998,1.273808569562686,0.81399474445225295,0.51573712816440453,0.32000556747550407]

{"sheet":"Norfolk","index":8,"n_rows":102,"n_cols":20,"rows_kept":102,"cut":false,"hidden":true,"merged":[[81,1,81,5],[81,8,81,12],[3,1,3,5],[3,8,3,12],[29,1,29,5],[29,8,29,12],[55,1,55,5],[55,8,55,12]]}
["Norfolk, NE-AERMOD setback distances (NE) as reported in the Odor Footprint Tool",null,null,null,null,null,null,null,null,null,null,null,null,null,"Total Scaled Odor Emission Rate (x10^6)",{"$f":"Inputs!E33","v":""}]
[null,null,null,null,null,null,null,null,null,null,null,null,null,null,"New Total Scaled Odor Emission Rate (x10^6)",{"$f":"Inputs!E42","v":""}]
["Setback Distances (m) for Norfolk, NE Direction",null,null,null,null,null,null,"Setback Distances (mi) for Norfolk, NE Direction"]
["x 104","Annoyance Free Percentage",null,null,null,null,null,"x 106","Annoyance Free Percentage",null,null,null,null,null,"Annoyance free percentage",99,98,96,94,90]
["OU/s",99,98,96,94,90,null,"OU/s",99,98,96,94,90,null,"Separation distance",{"$f":"IF(ISERROR(MATCH($P$1,$H$6:$H$24,0)),VLOOKUP($P$1,$H$6:$M$24,MATCH(P4,$I$5:$M$5,0)+1,TRUE)+($P$1-VLOOKUP($P$1,$H$6:$H$24,1,TRUE))*(INDEX($I$6:$M$24,MATCH($P$1,$H$6:$H$24,1)+1,MATCH(P4,$I$5:$M$5,0))-INDEX($I$6:$M$24,MATCH($P$1,$H$6:$H$24,1),MATCH(P4,$I$5:$M$5,0)))/(INDEX($H$6:$H$24,MATCH($P$1,$H$6:$H$24,1)+1)-INDEX($H$6:$H$24,MATCH($P$1,$H$6:$H$24,1))),INDEX($I$6:$M$24,MATCH($P$1,$H$6:$H$24,0),MATCH(P4,$I$5:$M$5,0)))","v":{"$error":"#N/A"}},{"$f":"IF(ISERROR(MATCH($P$1,$H$6:$H$24,0)),VLOOKUP($P$1,$H$6:$M$24,MATCH(Q4,$I$5:$M$5,0)+1,TRUE)+($P$1-VLOOKUP($P$1,$H$6:$H$24,1,TRUE))*(INDEX($I$6:$M$24,MATCH($P$1,$H$6:$H$24,1)+1,MATCH(Q4,$I$5:$M$5,0))-INDEX($I$6:$M$24,MATCH($P$1,$H$6:$H$24,1),MATCH(Q4,$I$5:$M$5,0)))/(INDEX($H$6:$H$24,MATCH($P$1,$H$6:$H$24,1)+1)-INDEX($H$6:$H$24,MATCH($P$1,$H$6:$H$24,1))),INDEX($I$6:$M$24,MATCH($P$1,$H$6:$H$24,0),MATCH(Q4,$I$5:$M$5,0)))","v":{"$error":"#N/A"}},{"$f":"IF(ISERROR(MATCH($P$1,$H$6:$H$24,0)),VLOOKUP($P$1,$H$6:$M$24,MATCH(R4,$I$5:$M$5,0)+1,TRUE)+($P$1-VLOOKUP($P$1,$H$6:$H$24,1,TRUE))*(INDEX($I$6:$M$24,MATCH($P$1,$H$6:$H$24,1)+1,MATCH(R4,$I$5:$M$5,0))-INDEX($I$6:$M$24,MATCH($P$1,$H$6:$H$24,1),MATCH(R4,$I$5:$M$5,0)))/(INDEX($H$6:$H$24,MATCH($P$1,$H$6:$H$24,1)+1)-INDEX($H$6:$H$24,MATCH($P$1,$H$6:$H$24,1))),INDEX($I$6:$M$24,MATCH($P$1,$H$6:$H$24,0),MATCH(R4,$I$5:$M$5,0)))","v":{"$error":"#N/A"}},{"$f":"IF(ISERROR(MATCH($P$1,$H$6:$H$24,0)),VLOOKUP($P$1,$H$6:$M$24,MATCH(S4,$I$5:$M$5,0)+1,TRUE)+($P$1-VLOOKUP($P$1,$H$6:$H$24,1,TRUE))*(INDEX($I$6:$M$24,MATCH($P$1,$H$6:$H$24,1)+1,MATCH(S4,$I$5:$M$5,0))-INDEX($I$6:$M$24,MATCH($P$1,$H$6:$H$24,1),MATCH(S4,$I$5:$M$5,0)))/(INDEX($H$6:$H$24,MATCH($P$1,$H$6:$H$24,1)+1)-INDEX($H$6:$H$24,MATCH($P$1,$H$6:$H$24,1))),INDEX($I$6:$M$24,MATCH($P$1,$H$6:$H$24,0),MATCH(S4,$I$5:$M$5,0)))","v":{"$error":"#N/A"}},{"$f":"IF(ISERROR(MATCH($P$1,$H$6:$H$24,0)),VLOOKUP($P$1,$H$6:$M$24,MATCH(T4,$I$5:$M$5,0)+1,TRUE)+($P$1-VLOOKUP($P$1,$H$6:$H$24,1,TRUE))*(INDEX($I$6:$M$24,MATCH($P$1,$H$6:$H$24,1)+1,MATCH(T4,$I$5:$M$5,0))-INDEX($I$6:$M$24,MATCH($P$1,$H$6:$H$24,1),MATCH(T4,$I$5:$M$5,0)))/(INDEX($H$6:$H$24,MATCH($P$1,$H$6:$H$24,1)+1)-INDEX($H$6:$H$24,MATCH($P$1,$H$6:$H$24,1))),INDEX($I$6:$M$24,MATCH($P$1,$H$6:$H$24,0),MATCH(T4,$I$5:$M$5,0)))","v":{"$error":"#N/A"}}]
[0,0,0,0,0,0,null,{"$f":"A6/100","v":0},0,0,0,0,0,null,"New Separation distance",{"$f":"IF(ISERROR(MATCH($P$2,$H$6:$H$24,0)),VLOOKUP($P$2,$H$6:$M$24,MATCH(P4,$I$5:$M$5,0)+1,TRUE)+($P$2-VLOOKUP($P$2,$H$6:$H$24,1,TRUE))*(INDEX($I$6:$M$24,MATCH($P$2,$H$6:$H$24,1)+1,MATCH(P4,$I$5:$M$5,0))-INDEX($I$6:$M$24,MATCH($P$2,$H$6:$H$24,1),MATCH(P4,$I$5:$M$5,0)))/(INDEX($H$6:$H$24,MATCH($P$2,$H$6:$H$24,1)+1)-INDEX($H$6:$H$24,MATCH($P$2,$H$6:$H$24,1))),INDEX($I$6:$M$24,MATCH($P$2,$H$6:$H$24,0),MATCH(P4,$I$5:$M$5,0)))","v":{"$error":"#N/A"}},{"$f":"IF(ISERROR(MATCH($P$2,$H$6:$H$24,0)),VLOOKUP($P$2,$H$6:$M$24,MATCH(Q4,$I$5:$M$5,0)+1,TRUE)+($P$2-VLOOKUP($P$2,$H$6:$H$24,1,TRUE))*(INDEX($I$6:$M$24,MATCH($P$2,$H$6:$H$24,1)+1,MATCH(Q4,$I$5:$M$5,0))-INDEX($I$6:$M$24,MATCH($P$2,$H$6:$H$24,1),MATCH(Q4,$I$5:$M$5,0)))/(INDEX($H$6:$H$24,MATCH($P$2,$H$6:$H$24,1)+1)-INDEX($H$6:$H$24,MATCH($P$2,$H$6:$H$24,1))),INDEX($I$6:$M$24,MATCH($P$2,$H$6:$H$24,0),MATCH(Q4,$I$5:$M$5,0)))","v":{"$error":"#N/A"}},{"$f":"IF(ISERROR(MATCH($P$2,$H$6:$H$24,0)),VLOOKUP($P$2,$H$6:$M$24,MATCH(R4,$I$5:$M$5,0)+1,TRUE)+($P$2-VLOOKUP($P$2,$H$6:$H$24,1,TRUE))*(INDEX($I$6:$M$24,MATCH($P$2,$H$6:$H$24,1)+1,MATCH(R4,$I$5:$M$5,0))-INDEX($I$6:$M$24,MATCH($P$2,$H$6:$H$24,1),MATCH(R4,$I$5:$M$5,0)))/(INDEX($H$6:$H$24,MATCH($P$2,$H$6:$H$24,1)+1)-INDEX($H$6:$H$24,MATCH($P$2,$H$6:$H$24,1))),INDEX($I$6:$M$24,MATCH($P$2,$H$6:$H$24,0),MATCH(R4,$I$5:$M$5,0)))","v":{"$error":"#N/A"}},{"$f":"IF(ISERROR(MATCH($P$2,$H$6:$H$24,0)),VLOOKUP($P$2,$H$6:$M$24,MATCH(S4,$I$5:$M$5,0)+1,TRUE)+($P$2-VLOOKUP($P$2,$H$6:$H$24,1,TRUE))*(INDEX($I$6:$M$24,MATCH($P$2,$H$6:$H$24,1)+1,MATCH(S4,$I$5:$M$5,0))-INDEX($I$6:$M$24,MATCH($P$2,$H$6:$H$24,1),MATCH(S4,$I$5:$M$5,0)))/(INDEX($H$6:$H$24,MATCH($P$2,$H$6:$H$24,1)+1)-INDEX($H$6:$H$24,MATCH($P$2,$H$6:$H$24,1))),INDEX($I$6:$M$24,MATCH($P$2,$H$6:$H$24,0),MATCH(S4,$I$5:$M$5,0)))","v":{"$error":"#N/A"}},{"$f":"IF(ISERROR(MATCH($P$2,$H$6:$H$24,0)),VLOOKUP($P$2,$H$6:$M$24,MATCH(T4,$I$5:$M$5,0)+1,TRUE)+($P$2-VLOOKUP($P$2,$H$6:$H$24,1,TRUE))*(INDEX($I$6:$M$24,MATCH($P$2,$H$6:$H$24,1)+1,MATCH(T4,$I$5:$M$5,0))-INDEX($I$6:$M$24,MATCH($P$2,$H$6:$H$24,1),MATCH(T4,$I$5:$M$5,0)))/(INDEX($H$6:$H$24,MATCH($P$2,$H$6:$H$24,1)+1)-INDEX($H$6:$H$24,MATCH($P$2,$H$6:$H$24,1))),INDEX($I$6:$M$24,MATCH($P$2,$H$6:$H$24,0),MATCH(T4,$I$5:$M$5,0)))","v":{"$error":"#N/A"}}]
[20,275,165,115,95,80,null,{"$f":"A7/100","v":0.2},{"$f":"+B7/1609.347","v":0.17087675933157984},0.1025260555989479,7.1457553902297022E-2,5.9030153223636667E-2,4.9709602714641407E-2]
[50,460,280,190,160,130,null,0.5,0.28583021560918809,0.17398360950124492,0.11806030644727333,9.9419205429282814E-2,8.0778104411292281E-2]
[100,685,425,285,235,185,null,1,0.42563847324411702,0.26408226442153249,0.17709045967091,0.14602195797425913,0.11495345627760825]
[200,970,625,375,330,245,null,2,0.60272893291502705,0.38835627120813598,0.23301376272488158,0.20505211119789579,0.15223565831358929]
[300,1240,785,495,420,325,null,3,0.77049884207694175,0.48777547663741877,0.30757816679684369,0.26097541425186738,0.20194526102823071]
[400,1485,920,575,480,380,null,4,0.92273450039053106,0.57166043121837617,0.35728776951148511,0.29825761628784841,0.23612061289454667]
[500,1675,1065,670,525,415,null,5,1.0407948068378043,0.66175908613866374,0.41631792273512175,0.32621926781483424,0.25786856408220227]
[600,1880,1200,730,590,445,null,6,1.168175663794073,0.74564404071962109,0.45360012477110284,0.36660832002048038,0.27650966510019281]
[700,2055,1285,820,650,490,null,7,1.2769154197323511,0.79846049360392757,0.50952342782507443,0.40389052205646142,0.30447131662717858]
[800,2270,1420,870,715,530,null,8,1.4105099770279499,0.88234544818488492,0.5405919295217253,0.44427957426210757,0.32932611798449929]
[900,2430,1510,925,750,560,null,9,1.5099291824572327,0.93826875123885656,0.57476728138804123,0.46602752544976317,0.34796721900248984]
[1000,2575,1600,975,785,590,null,10,1.6000278373775203,0.99419205429282809,0.6058357830846921,0.48777547663741877,0.36660832002048038]
[1500,3250,1950,1175,950,710,null,15,2.0194526102823072,1.2116715661693842,0.7301097898712956,0.59030153223636672,0.44117272409244246]
[2000,3850,2290,1410,1110,800,null,20,2.3922746306421176,1.4229373777066101,0.87613174784555481,0.68972073766564945,0.49709602714641404]
[2500,4465,2675,1615,1270,930,null,25,2.7744172015109232,1.662164840770822,1.0035126048018235,0.78913994309493229,0.57787413155770628]
[3000,4965,3050,1800,1420,1025,null,30,3.0851022184774322,1.8951786034957037,1.1184660610794317,0.88234544818488492,0.63690428478134298]
[3500,5375,3340,1965,1555,1120,null,35,{"$f":"+B23/1609.347","v":3.3398639323899695},2.0753759133362788,1.2209921166783795,0.96623040276584227,0.69593443800497967]
[4000,5790,3600,2075,1650,1150,null,40,3.5977324964721715,2.2369321221588634,1.2893428204110113,1.025260555989479,0.71457553902297022]
[]
[]
["Norfolk, NE-AERMOD setback distances (SE) as reported in the Odor Footprint Tool"]
[]
["Setback Distances (m) for Norfolk, SE Direction",null,null,null,null,null,null,"Setback Distances (mi) for Norfolk, SE Direction"]
["x 104","Annoyance Free Percentage",null,null,null,null,null,"x 106","Annoyance Free Percentage"]
["OU/s",99,98,96,94,90,null,"OU/s",99,98,96,94,90,null,"Separation distance",{"$f":"IF(ISERROR(MATCH($P$1,$H$32:$H$50,0)),VLOOKUP($P$1,$H$32:$M$50,MATCH(P$4,$I$31:$M$31,0)+1,TRUE)+($P$1-VLOOKUP($P$1,$H$32:$H$50,1,TRUE))*(INDEX($I$32:$M$50,MATCH($P$1,$H$32:$H$50,1)+1,MATCH(P$4,$I$31:$M$31,0))-INDEX($I$32:$M$50,MATCH($P$1,$H$32:$H$50,1),MATCH(P$4,$I$31:$M$31,0)))/(INDEX($H$32:$H$50,MATCH($P$1,$H$32:$H$50,1)+1)-INDEX($H$32:$H$50,MATCH($P$1,$H$32:$H$50,1))),INDEX($I$32:$M$50,MATCH($P$1,$H$32:$H$50,0),MATCH(P4,$I$31:$M$31,0)))","v":{"$error":"#N/A"}},{"$f":"IF(ISERROR(MATCH($P$1,$H$32:$H$50,0)),VLOOKUP($P$1,$H$32:$M$50,MATCH(Q$4,$I$31:$M$31,0)+1,TRUE)+($P$1-VLOOKUP($P$1,$H$32:$H$50,1,TRUE))*(INDEX($I$32:$M$50,MATCH($P$1,$H$32:$H$50,1)+1,MATCH(Q$4,$I$31:$M$31,0))-INDEX($I$32:$M$50,MATCH($P$1,$H$32:$H$50,1),MATCH(Q$4,$I$31:$M$31,0)))/(INDEX($H$32:$H$50,MATCH($P$1,$H$32:$H$50,1)+1)-INDEX($H$32:$H$50,MATCH($P$1,$H$32:$H$50,1))),INDEX($I$32:$M$50,MATCH($P$1,$H$32:$H$50,0),MATCH(Q4,$I$31:$M$31,0)))","v":{"$error":"#N/A"}},{"$f":"IF(ISERROR(MATCH($P$1,$H$32:$H$50,0)),VLOOKUP($P$1,$H$32:$M$50,MATCH(R$4,$I$31:$M$31,0)+1,TRUE)+($P$1-VLOOKUP($P$1,$H$32:$H$50,1,TRUE))*(INDEX($I$32:$M$50,MATCH($P$1,$H$32:$H$50,1)+1,MATCH(R$4,$I$31:$M$31,0))-INDEX($I$32:$M$50,MATCH($P$1,$H$32:$H$50,1),MATCH(R$4,$I$31:$M$31,0)))/(INDEX($H$32:$H$50,MATCH($P$1,$H$32:$H$50,1)+1)-INDEX($H$32:$H$50,MATCH($P$1,$H$32:$H$50,1))),INDEX($I$32:$M$50,MATCH($P$1,$H$32:$H$50,0),MATCH(R4,$I$31:$M$31,0)))","v":{"$error":"#N/A"}},{"$f":"IF(ISERROR(MATCH($P$1,$H$32:$H$50,0)),VLOOKUP($P$1,$H$32:$M$50,MATCH(S$4,$I$31:$M$31,0)+1,TRUE)+($P$1-VLOOKUP($P$1,$H$32:$H$50,1,TRUE))*(INDEX($I$32:$M$50,MATCH($P$1,$H$32:$H$50,1)+1,MATCH(S$4,$I$31:$M$31,0))-INDEX($I$32:$M$50,MATCH($P$1,$H$32:$H$50,1),MATCH(S$4,$I$31:$M$31,0)))/(INDEX($H$32:$H$50,MATCH($P$1,$H$32:$H$50,1)+1)-INDEX($H$32:$H$50,MATCH($P$1,$H$32:$H$50,1))),INDEX($I$32:$M$50,MATCH($P$1,$H$32:$H$50,0),MATCH(S4,$I$31:$M$31,0)))","v":{"$error":"#N/A"}},{"$f":"IF(ISERROR(MATCH($P$1,$H$32:$H$50,0)),VLOOKUP($P$1,$H$32:$M$50,MATCH(T$4,$I$31:$M$31,0)+1,TRUE)+($P$1-VLOOKUP($P$1,$H$32:$H$50,1,TRUE))*(INDEX($I$32:$M$50,MATCH($P$1,$H$32:$H$50,1)+1,MATCH(T$4,$I$31:$M$31,0))-INDEX($I$32:$M$50,MATCH($P$1,$H$32:$H$50,1),MATCH(T$4,$I$31:$M$31,0)))/(INDEX($H$32:$H$50,MATCH($P$1,$H$32:$H$50,1)+1)-INDEX($H$32:$H$50,MATCH($P$1,$H$32:$H$50,1))),INDEX($I$32:$M$50,MATCH($P$1,$H$32:$H$50,0),MATCH(T4,$I$31:$M$31,0)))","v":{"$error":"#N/A"}}]
[0,0,0,0,0,0,null,{"$f":"A32/100","v":0},0,0,0,0,0,null,"New Separation distance",{"$f":"IF(ISERROR(MATCH($P$2,$H$32:$H$50,0)),VLOOKUP($P$2,$H$32:$M$50,MATCH(P$4,$I$31:$M$31,0)+1,TRUE)+($P$2-VLOOKUP($P$2,$H$32:$H$50,1,TRUE))*(INDEX($I$32:$M$50,MATCH($P$2,$H$32:$H$50,1)+1,MATCH(P$4,$I$31:$M$31,0))-INDEX($I$32:$M$50,MATCH($P$2,$H$32:$H$50,1),MATCH(P$4,$I$31:$M$31,0)))/(INDEX($H$32:$H$50,MATCH($P$2,$H$32:$H$50,1)+1)-INDEX($H$32:$H$50,MATCH($P$2,$H$32:$H$50,1))),INDEX($I$32:$M$50,MATCH($P$2,$H$32:$H$50,0),MATCH(P4,$I$31:$M$31,0)))","v":{"$error":"#N/A"}},{"$f":"IF(ISERROR(MATCH($P$2,$H$32:$H$50,0)),VLOOKUP($P$2,$H$32:$M$50,MATCH(Q$4,$I$31:$M$31,0)+1,TRUE)+($P$2-VLOOKUP($P$2,$H$32:$H$50,1,TRUE))*(INDEX($I$32:$M$50,MATCH($P$2,$H$32:$H$50,1)+1,MATCH(Q$4,$I$31:$M$31,0))-INDEX($I$32:$M$50,MATCH($P$2,$H$32:$H$50,1),MATCH(Q$4,$I$31:$M$31,0)))/(INDEX($H$32:$H$50,MATCH($P$2,$H$32:$H$50,1)+1)-INDEX($H$32:$H$50,MATCH($P$2,$H$32:$H$50,1))),INDEX($I$32:$M$50,MATCH($P$2,$H$32:$H$50,0),MATCH(Q4,$I$31:$M$31,0)))","v":{"$error":"#N/A"}},{"$f":"IF(ISERROR(MATCH($P$2,$H$32:$H$50,0)),VLOOKUP($P$2,$H$32:$M$50,MATCH(R$4,$I$31:$M$31,0)+1,TRUE)+($P$2-VLOOKUP($P$2,$H$32:$H$50,1,TRUE))*(INDEX($I$32:$M$50,MATCH($P$2,$H$32:$H$50,1)+1,MATCH(R$4,$I$31:$M$31,0))-INDEX($I$32:$M$50,MATCH($P$2,$H$32:$H$50,1),MATCH(R$4,$I$31:$M$31,0)))/(INDEX($H$32:$H$50,MATCH($P$2,$H$32:$H$50,1)+1)-INDEX($H$32:$H$50,MATCH($P$2,$H$32:$H$50,1))),INDEX($I$32:$M$50,MATCH($P$2,$H$32:$H$50,0),MATCH(R4,$I$31:$M$31,0)))","v":{"$error":"#N/A"}},{"$f":"IF(ISERROR(MATCH($P$2,$H$32:$H$50,0)),VLOOKUP($P$2,$H$32:$M$50,MATCH(S$4,$I$31:$M$31,0)+1,TRUE)+($P$2-VLOOKUP($P$2,$H$32:$H$50,1,TRUE))*(INDEX($I$32:$M$50,MATCH($P$2,$H$32:$H$50,1)+1,MATCH(S$4,$I$31:$M$31,0))-INDEX($I$32:$M$50,MATCH($P$2,$H$32:$H$50,1),MATCH(S$4,$I$31:$M$31,0)))/(INDEX($H$32:$H$50,MATCH($P$2,$H$32:$H$50,1)+1)-INDEX($H$32:$H$50,MATCH($P$2,$H$32:$H$50,1))),INDEX($I$32:$M$50,MATCH($P$2,$H$32:$H$50,0),MATCH(S4,$I$31:$M$31,0)))","v":{"$error":"#N/A"}},{"$f":"IF(ISERROR(MATCH($P$2,$H$32:$H$50,0)),VLOOKUP($P$2,$H$32:$M$50,MATCH(T$4,$I$31:$M$31,0)+1,TRUE)+($P$2-VLOOKUP($P$2,$H$32:$H$50,1,TRUE))*(INDEX($I$32:$M$50,MATCH($P$2,$H$32:$H$50,1)+1,MATCH(T$4,$I$31:$M$31,0))-INDEX($I$32:$M$50,MATCH($P$2,$H$32:$H$50,1),MATCH(T$4,$I$31:$M$31,0)))/(INDEX($H$32:$H$50,MATCH($P$2,$H$32:$H$50,1)+1)-INDEX($H$32:$H$50,MATCH($P$2,$H$32:$H$50,1))),INDEX($I$32:$M$50,MATCH($P$2,$H$32:$H$50,0),MATCH(T4,$I$31:$M$31,0)))","v":{"$error":"#N/A"}}]
[20,300,165,100,80,60,null,{"$f":"A33/100","v":0.2},{"$f":"+B33/1609.347","v":0.18641101017990527},{"$f":"+C33/1609.347","v":0.1025260555989479},{"$f":"+D33/1609.347","v":6.2137003393301755E-2},{"$f":"+E33/1609.347","v":4.9709602714641407E-2},{"$f":"+F33/1609.347","v":3.7282202035981052E-2}]
[50,510,270,160,125,90,null,0.5,{"$f":"+B34/1609.347","v":0.31689871730583896},0.16776990916191475,9.9419205429282814E-2,7.7671254241627199E-2,5.5923303053971578E-2]
[100,745,385,225,180,120,null,1,0.46292067528009806,0.23922746306421175,0.13980825763492896,0.11184660610794316,7.4564404071962104E-2]
[200,1095,555,315,250,165,null,2,0.68040018715665418,0.34486036883282473,0.19573156068890052,0.1553425084832544,0.1025260555989479]
[300,1365,670,385,300,190,null,3,0.84817009631856899,0.41631792273512175,0.23922746306421175,0.18641101017990527,0.11806030644727333]
[400,1560,785,445,345,210,null,4,0.96933725293550743,0.48777547663741877,0.27650966510019281,0.21437266170689107,0.13048770712593369]
[500,1790,860,485,385,230,null,5,1.1122523607401014,0.53437822918239508,0.30136446645751352,0.23922746306421175,0.14291510780459404]
[600,1970,935,530,415,245,null,6,1.2240989668480446,0.58098098172737145,0.32932611798449929,0.25786856408220227,0.15223565831358929]
[700,2155,1020,585,445,260,null,7,1.3390524231256529,0.63379743461167792,0.36350146985081527,0.27650966510019281,0.16155620882258456]
[800,2320,1085,615,470,270,null,8,1.4415784787246007,0.67418648681732407,0.38214257086880582,0.29204391594851825,0.16776990916191475]
[900,2490,1160,655,505,290,null,9,1.5472113844932138,0.72078923936230033,0.40699737222612647,0.31379186713617385,0.18019730984057508]
[1000,2650,1230,695,525,300,null,10,1.6466305899224964,0.76428514173761164,0.43185217358344719,0.32621926781483424,0.18641101017990527]
[1500,3300,1510,825,620,325,null,15,2.0505211119789579,0.93826875123885656,0.51263027799473948,0.38524942103847087,0.20194526102823071]
[2000,3880,1725,975,695,360,null,20,2.4109157316601082,1.0718633085344553,0.6058357830846921,0.43185217358344719,0.22369321221588631]
[2500,4350,1955,1085,755,395,null,25,2.7029596476086262,1.2147784163390494,0.67418648681732407,0.46913437561942828,0.24544116340354194]
[3000,4800,2130,1175,830,450,null,30,2.9825761628784844,1.3235181722773275,0.7301097898712956,0.51573712816440453,0.27961651526985792]
[3500,5240,2265,1280,885,435,null,35,3.2559789778090118,1.4074031268582847,0.79535364343426251,0.54991248003072057,0.27029596476086265]
[4000,5615,2405,1355,875,465,null,40,3.4889927405338934,1.4943949316089071,0.84195639597923877,0.54369877969139035,0.28893706577885314]
[]
[]
["Norfolk, NE - AERMOD setback distances (SW) as reported in the Odor Footprint Tool"]
[]
["Setback Distances (m) for Norfolk, SW Direction",null,null,null,null,null,null,"Setback Distances (mi) for Norfolk, SW Direction"]
["x 104","Annoyance Free Percentage",null,null,null,null,null,"x 106","Annoyance Free Percentage"]
["OU/s",99,98,96,94,90,null,"OU/s",99,98,96,94,90,null,"Separation distance",{"$f":"IF(ISERROR(MATCH($P$1,$H$58:$H$76,0)),VLOOKUP($P$1,$H$58:$M$76,MATCH(P$4,$I$57:$M$57,0)+1,TRUE)+($P$1-VLOOKUP($P$1,$H$58:$H$76,1,TRUE))*(INDEX($I$58:$M$76,MATCH($P$1,$H$58:$H$76,1)+1,MATCH(P$4,$I$57:$M$57,0))-INDEX($I$58:$M$76,MATCH($P$1,$H$58:$H$76,1),MATCH(P$4,$I$57:$M$57,0)))/(INDEX($H$58:$H$76,MATCH($P$1,$H$58:$H$76,1)+1)-INDEX($H$58:$H$76,MATCH($P$1,$H$58:$H$76,1))),INDEX($I$58:$M$76,MATCH($P$1,$H$58:$H$76,0),MATCH(P$4,$I$57:$M$57,0)))","v":{"$error":"#N/A"}},{"$f":"IF(ISERROR(MATCH($P$1,$H$58:$H$76,0)),VLOOKUP($P$1,$H$58:$M$76,MATCH(Q$4,$I$57:$M$57,0)+1,TRUE)+($P$1-VLOOKUP($P$1,$H$58:$H$76,1,TRUE))*(INDEX($I$58:$M$76,MATCH($P$1,$H$58:$H$76,1)+1,MATCH(Q$4,$I$57:$M$57,0))-INDEX($I$58:$M$76,MATCH($P$1,$H$58:$H$76,1),MATCH(Q$4,$I$57:$M$57,0)))/(INDEX($H$58:$H$76,MATCH($P$1,$H$58:$H$76,1)+1)-INDEX($H$58:$H$76,MATCH($P$1,$H$58:$H$76,1))),INDEX($I$58:$M$76,MATCH($P$1,$H$58:$H$76,0),MATCH(Q$4,$I$57:$M$57,0)))","v":{"$error":"#N/A"}},{"$f":"IF(ISERROR(MATCH($P$1,$H$58:$H$76,0)),VLOOKUP($P$1,$H$58:$M$76,MATCH(R$4,$I$57:$M$57,0)+1,TRUE)+($P$1-VLOOKUP($P$1,$H$58:$H$76,1,TRUE))*(INDEX($I$58:$M$76,MATCH($P$1,$H$58:$H$76,1)+1,MATCH(R$4,$I$57:$M$57,0))-INDEX($I$58:$M$76,MATCH($P$1,$H$58:$H$76,1),MATCH(R$4,$I$57:$M$57,0)))/(INDEX($H$58:$H$76,MATCH($P$1,$H$58:$H$76,1)+1)-INDEX($H$58:$H$76,MATCH($P$1,$H$58:$H$76,1))),INDEX($I$58:$M$76,MATCH($P$1,$H$58:$H$76,0),MATCH(R$4,$I$57:$M$57,0)))","v":{"$error":"#N/A"}},{"$f":"IF(ISERROR(MATCH($P$1,$H$58:$H$76,0)),VLOOKUP($P$1,$H$58:$M$76,MATCH(S$4,$I$57:$M$57,0)+1,TRUE)+($P$1-VLOOKUP($P$1,$H$58:$H$76,1,TRUE))*(INDEX($I$58:$M$76,MATCH($P$1,$H$58:$H$76,1)+1,MATCH(S$4,$I$57:$M$57,0))-INDEX($I$58:$M$76,MATCH($P$1,$H$58:$H$76,1),MATCH(S$4,$I$57:$M$57,0)))/(INDEX($H$58:$H$76,MATCH($P$1,$H$58:$H$76,1)+1)-INDEX($H$58:$H$76,MATCH($P$1,$H$58:$H$76,1))),INDEX($I$58:$M$76,MATCH($P$1,$H$58:$H$76,0),MATCH(S$4,$I$57:$M$57,0)))","v":{"$error":"#N/A"}},{"$f":"IF(ISERROR(MATCH($P$1,$H$58:$H$76,0)),VLOOKUP($P$1,$H$58:$M$76,MATCH(T$4,$I$57:$M$57,0)+1,TRUE)+($P$1-VLOOKUP($P$1,$H$58:$H$76,1,TRUE))*(INDEX($I$58:$M$76,MATCH($P$1,$H$58:$H$76,1)+1,MATCH(T$4,$I$57:$M$57,0))-INDEX($I$58:$M$76,MATCH($P$1,$H$58:$H$76,1),MATCH(T$4,$I$57:$M$57,0)))/(INDEX($H$58:$H$76,MATCH($P$1,$H$58:$H$76,1)+1)-INDEX($H$58:$H$76,MATCH($P$1,$H$58:$H$76,1))),INDEX($I$58:$M$76,MATCH($P$1,$H$58:$H$76,0),MATCH(T$4,$I$57:$M$57,0)))","v":{"$error":"#N/A"}}]
[0,0,0,0,0,0,null,{"$f":"A58/100","v":0},0,0,0,0,0,null,"New Separation distance",{"$f":"IF(ISERROR(MATCH($P$2,$H$58:$H$76,0)),VLOOKUP($P$2,$H$58:$M$76,MATCH(P$4,$I$57:$M$57,0)+1,TRUE)+($P$2-VLOOKUP($P$2,$H$58:$H$76,1,TRUE))*(INDEX($I$58:$M$76,MATCH($P$2,$H$58:$H$76,1)+1,MATCH(P$4,$I$57:$M$57,0))-INDEX($I$58:$M$76,MATCH($P$2,$H$58:$H$76,1),MATCH(P$4,$I$57:$M$57,0)))/(INDEX($H$58:$H$76,MATCH($P$2,$H$58:$H$76,1)+1)-INDEX($H$58:$H$76,MATCH($P$2,$H$58:$H$76,1))),INDEX($I$58:$M$76,MATCH($P$2,$H$58:$H$76,0),MATCH(P4,$I$57:$M$57,0)))","v":{"$error":"#N/A"}},{"$f":"IF(ISERROR(MATCH($P$2,$H$58:$H$76,0)),VLOOKUP($P$2,$H$58:$M$76,MATCH(Q$4,$I$57:$M$57,0)+1,TRUE)+($P$2-VLOOKUP($P$2,$H$58:$H$76,1,TRUE))*(INDEX($I$58:$M$76,MATCH($P$2,$H$58:$H$76,1)+1,MATCH(Q$4,$I$57:$M$57,0))-INDEX($I$58:$M$76,MATCH($P$2,$H$58:$H$76,1),MATCH(Q$4,$I$57:$M$57,0)))/(INDEX($H$58:$H$76,MATCH($P$2,$H$58:$H$76,1)+1)-INDEX($H$58:$H$76,MATCH($P$2,$H$58:$H$76,1))),INDEX($I$58:$M$76,MATCH($P$2,$H$58:$H$76,0),MATCH(Q4,$I$57:$M$57,0)))","v":{"$error":"#N/A"}},{"$f":"IF(ISERROR(MATCH($P$2,$H$58:$H$76,0)),VLOOKUP($P$2,$H$58:$M$76,MATCH(R$4,$I$57:$M$57,0)+1,TRUE)+($P$2-VLOOKUP($P$2,$H$58:$H$76,1,TRUE))*(INDEX($I$58:$M$76,MATCH($P$2,$H$58:$H$76,1)+1,MATCH(R$4,$I$57:$M$57,0))-INDEX($I$58:$M$76,MATCH($P$2,$H$58:$H$76,1),MATCH(R$4,$I$57:$M$57,0)))/(INDEX($H$58:$H$76,MATCH($P$2,$H$58:$H$76,1)+1)-INDEX($H$58:$H$76,MATCH($P$2,$H$58:$H$76,1))),INDEX($I$58:$M$76,MATCH($P$2,$H$58:$H$76,0),MATCH(R4,$I$57:$M$57,0)))","v":{"$error":"#N/A"}},{"$f":"IF(ISERROR(MATCH($P$2,$H$58:$H$76,0)),VLOOKUP($P$2,$H$58:$M$76,MATCH(S$4,$I$57:$M$57,0)+1,TRUE)+($P$2-VLOOKUP($P$2,$H$58:$H$76,1,TRUE))*(INDEX($I$58:$M$76,MATCH($P$2,$H$58:$H$76,1)+1,MATCH(S$4,$I$57:$M$57,0))-INDEX($I$58:$M$76,MATCH($P$2,$H$58:$H$76,1),MATCH(S$4,$I$57:$M$57,0)))/(INDEX($H$58:$H$76,MATCH($P$2,$H$58:$H$76,1)+1)-INDEX($H$58:$H$76,MATCH($P$2,$H$58:$H$76,1))),INDEX($I$58:$M$76,MATCH($P$2,$H$58:$H$76,0),MATCH(S4,$I$57:$M$57,0)))","v":{"$error":"#N/A"}},{"$f":"IF(ISERROR(MATCH($P$2,$H$58:$H$76,0)),VLOOKUP($P$2,$H$58:$M$76,MATCH(T$4,$I$57:$M$57,0)+1,TRUE)+($P$2-VLOOKUP($P$2,$H$58:$H$76,1,TRUE))*(INDEX($I$58:$M$76,MATCH($P$2,$H$58:$H$76,1)+1,MATCH(T$4,$I$57:$M$57,0))-INDEX($I$58:$M$76,MATCH($P$2,$H$58:$H$76,1),MATCH(T$4,$I$57:$M$57,0)))/(INDEX($H$58:$H$76,MATCH($P$2,$H$58:$H$76,1)+1)-INDEX($H$58:$H$76,MATCH($P$2,$H$58:$H$76,1))),INDEX($I$58:$M$76,MATCH($P$2,$H$58:$H$76,0),MATCH(T4,$I$57:$M$57,0)))","v":{"$error":"#N/A"}}]
[20,185,120,90,75,55,null,{"$f":"A59/100","v":0.2},{"$f":"+B59/1609.347","v":0.11495345627760825},7.4564404071962104E-2,5.5923303053971578E-2,4.6602752544976318E-2,3.4175351866315963E-2]
[50,300,190,135,105,65,null,0.5,0.18641101017990527,0.11806030644727333,8.3884954580957377E-2,6.5243853562966844E-2,4.0389052205646141E-2]
[100,435,270,185,150,90,null,1,0.27029596476086265,0.16776990916191475,0.11495345627760825,9.3205505089952637E-2,5.5923303053971578E-2]
[200,610,400,290,225,130,null,2,0.37903572069914071,0.24854801357320702,0.18019730984057508,0.13980825763492896,8.0778104411292281E-2]
[300,745,490,360,260,145,null,3,0.46292067528009806,0.30447131662717858,0.22369321221588631,0.16155620882258456,9.0098654920287541E-2]
[400,880,580,430,295,175,null,4,0.54680562986105541,0.36039461968115016,0.26718911459119754,0.18330416001024019,0.10873975593827807]
[500,975,645,475,325,175,null,5,0.6058357830846921,0.40078367188679631,0.29515076611818336,0.20194526102823071,0.10873975593827807]
[600,1080,710,510,350,195,null,6,0.67107963664765902,0.44117272409244246,0.31689871730583896,0.21747951187655615,0.12116715661693843]
[700,1165,760,530,370,200,null,7,0.72389608953196549,0.47224122578909333,0.32932611798449929,0.2299069125552165,0.12427400678660351]
[800,1235,805,555,390,205,null,8,0.76739199190727669,0.50020287731607915,0.34486036883282473,0.24233431323387686,0.12738085695626861]
[900,1340,845,580,420,210,null,9,0.8326358454702435,0.52505767867339981,0.36039461968115016,0.26097541425186738,0.13048770712593369]
[1000,1425,895,600,440,215,null,10,0.88545229835454997,0.55612618037005068,0.37282202035981055,0.2734028149305277,0.13359455729559877]
[1500,1790,1130,710,475,215,null,15,1.1122523607401014,0.70214813834430989,0.44117272409244246,0.29515076611818336,0.13359455729559877]
[2000,2085,1320,785,510,220,null,20,1.2955565207503417,0.82020844479158317,0.48777547663741877,0.31689871730583896,0.13670140746526385]
[2500,2300,1450,870,575,230,null,25,1.4291510780459404,0.90098654920287546,0.5405919295217253,0.35728776951148511,0.14291510780459404]
[3000,2530,1575,975,615,240,null,30,1.5720661858505345,0.97865780344450271,0.6058357830846921,0.38214257086880582,0.14912880814392421]
[3500,2750,1695,1055,650,255,null,35,1.7087675933157982,1.0532222075164648,0.65554538579933352,0.40389052205646142,0.15844935865291948]
[4000,3015,1780,1110,680,265,null,40,1.873430652308048,1.1060386604007713,0.68972073766564945,0.42253162307445197,0.16466305899224964]
[]
[]
["Norfolk, NE - AERMOD setback distances (NW) as reported in the Odor Footprint Tool"]
[]
["Setback Distances (m) for Norfolk, NW Direction",null,null,null,null,null,null,"Setback Distances (mi) for Norfolk, NW Direction"]
["x 104","Annoyance Free Percentage",null,null,null,null,null,"x 106","Annoyance Free Percentage"]
["OU/s",99,98,96,94,90,null,"OU/s",99,98,96,94,90,null,"Separation distance",{"$f":"IF(ISERROR(MATCH($P$1,$H$84:$H$102,0)),VLOOKUP($P$1,$H$84:$M$102,MATCH(P$4,$I$83:$M$83,0)+1,TRUE)+($P$1-VLOOKUP($P$1,$H$84:$H$102,1,TRUE))*(INDEX($I$84:$M$102,MATCH($P$1,$H$84:$H$102,1)+1,MATCH(P$4,$I$83:$M$83,0))-INDEX($I$84:$M$102,MATCH($P$1,$H$84:$H$102,1),MATCH(P$4,$I$83:$M$83,0)))/(INDEX($H$84:$H$102,MATCH($P$1,$H$84:$H$102,1)+1)-INDEX($H$84:$H$102,MATCH($P$1,$H$84:$H$102,1))),INDEX($I$84:$M$102,MATCH($P$1,$H$84:$H$102,0),MATCH(P4,$I$83:$M$83,0)))","v":{"$error":"#N/A"}},{"$f":"IF(ISERROR(MATCH($P$1,$H$84:$H$102,0)),VLOOKUP($P$1,$H$84:$M$102,MATCH(Q$4,$I$83:$M$83,0)+1,TRUE)+($P$1-VLOOKUP($P$1,$H$84:$H$102,1,TRUE))*(INDEX($I$84:$M$102,MATCH($P$1,$H$84:$H$102,1)+1,MATCH(Q$4,$I$83:$M$83,0))-INDEX($I$84:$M$102,MATCH($P$1,$H$84:$H$102,1),MATCH(Q$4,$I$83:$M$83,0)))/(INDEX($H$84:$H$102,MATCH($P$1,$H$84:$H$102,1)+1)-INDEX($H$84:$H$102,MATCH($P$1,$H$84:$H$102,1))),INDEX($I$84:$M$102,MATCH($P$1,$H$84:$H$102,0),MATCH(Q4,$I$83:$M$83,0)))","v":{"$error":"#N/A"}},{"$f":"IF(ISERROR(MATCH($P$1,$H$84:$H$102,0)),VLOOKUP($P$1,$H$84:$M$102,MATCH(R$4,$I$83:$M$83,0)+1,TRUE)+($P$1-VLOOKUP($P$1,$H$84:$H$102,1,TRUE))*(INDEX($I$84:$M$102,MATCH($P$1,$H$84:$H$102,1)+1,MATCH(R$4,$I$83:$M$83,0))-INDEX($I$84:$M$102,MATCH($P$1,$H$84:$H$102,1),MATCH(R$4,$I$83:$M$83,0)))/(INDEX($H$84:$H$102,MATCH($P$1,$H$84:$H$102,1)+1)-INDEX($H$84:$H$102,MATCH($P$1,$H$84:$H$102,1))),INDEX($I$84:$M$102,MATCH($P$1,$H$84:$H$102,0),MATCH(R4,$I$83:$M$83,0)))","v":{"$error":"#N/A"}},{"$f":"IF(ISERROR(MATCH($P$1,$H$84:$H$102,0)),VLOOKUP($P$1,$H$84:$M$102,MATCH(S$4,$I$83:$M$83,0)+1,TRUE)+($P$1-VLOOKUP($P$1,$H$84:$H$102,1,TRUE))*(INDEX($I$84:$M$102,MATCH($P$1,$H$84:$H$102,1)+1,MATCH(S$4,$I$83:$M$83,0))-INDEX($I$84:$M$102,MATCH($P$1,$H$84:$H$102,1),MATCH(S$4,$I$83:$M$83,0)))/(INDEX($H$84:$H$102,MATCH($P$1,$H$84:$H$102,1)+1)-INDEX($H$84:$H$102,MATCH($P$1,$H$84:$H$102,1))),INDEX($I$84:$M$102,MATCH($P$1,$H$84:$H$102,0),MATCH(S4,$I$83:$M$83,0)))","v":{"$error":"#N/A"}},{"$f":"IF(ISERROR(MATCH($P$1,$H$84:$H$102,0)),VLOOKUP($P$1,$H$84:$M$102,MATCH(T$4,$I$83:$M$83,0)+1,TRUE)+($P$1-VLOOKUP($P$1,$H$84:$H$102,1,TRUE))*(INDEX($I$84:$M$102,MATCH($P$1,$H$84:$H$102,1)+1,MATCH(T$4,$I$83:$M$83,0))-INDEX($I$84:$M$102,MATCH($P$1,$H$84:$H$102,1),MATCH(T$4,$I$83:$M$83,0)))/(INDEX($H$84:$H$102,MATCH($P$1,$H$84:$H$102,1)+1)-INDEX($H$84:$H$102,MATCH($P$1,$H$84:$H$102,1))),INDEX($I$84:$M$102,MATCH($P$1,$H$84:$H$102,0),MATCH(T4,$I$83:$M$83,0)))","v":{"$error":"#N/A"}}]
[0,0,0,0,0,0,null,{"$f":"A84/100","v":0},0,0,0,0,0,null,"New Separation distance",{"$f":"IF(ISERROR(MATCH($P$2,$H$84:$H$102,0)),VLOOKUP($P$2,$H$84:$M$102,MATCH(P$4,$I$83:$M$83,0)+1,TRUE)+($P$2-VLOOKUP($P$2,$H$84:$H$102,1,TRUE))*(INDEX($I$84:$M$102,MATCH($P$2,$H$84:$H$102,1)+1,MATCH(P$4,$I$83:$M$83,0))-INDEX($I$84:$M$102,MATCH($P$2,$H$84:$H$102,1),MATCH(P$4,$I$83:$M$83,0)))/(INDEX($H$84:$H$102,MATCH($P$2,$H$84:$H$102,1)+1)-INDEX($H$84:$H$102,MATCH($P$2,$H$84:$H$102,1))),INDEX($I$84:$M$102,MATCH($P$2,$H$84:$H$102,0),MATCH(P4,$I$83:$M$83,0)))","v":{"$error":"#N/A"}},{"$f":"IF(ISERROR(MATCH($P$2,$H$84:$H$102,0)),VLOOKUP($P$2,$H$84:$M$102,MATCH(Q$4,$I$83:$M$83,0)+1,TRUE)+($P$2-VLOOKUP($P$2,$H$84:$H$102,1,TRUE))*(INDEX($I$84:$M$102,MATCH($P$2,$H$84:$H$102,1)+1,MATCH(Q$4,$I$83:$M$83,0))-INDEX($I$84:$M$102,MATCH($P$2,$H$84:$H$102,1),MATCH(Q$4,$I$83:$M$83,0)))/(INDEX($H$84:$H$102,MATCH($P$2,$H$84:$H$102,1)+1)-INDEX($H$84:$H$102,MATCH($P$2,$H$84:$H$102,1))),INDEX($I$84:$M$102,MATCH($P$2,$H$84:$H$102,0),MATCH(Q4,$I$83:$M$83,0)))","v":{"$error":"#N/A"}},{"$f":"IF(ISERROR(MATCH($P$2,$H$84:$H$102,0)),VLOOKUP($P$2,$H$84:$M$102,MATCH(R$4,$I$83:$M$83,0)+1,TRUE)+($P$2-VLOOKUP($P$2,$H$84:$H$102,1,TRUE))*(INDEX($I$84:$M$102,MATCH($P$2,$H$84:$H$102,1)+1,MATCH(R$4,$I$83:$M$83,0))-INDEX($I$84:$M$102,MATCH($P$2,$H$84:$H$102,1),MATCH(R$4,$I$83:$M$83,0)))/(INDEX($H$84:$H$102,MATCH($P$2,$H$84:$H$102,1)+1)-INDEX($H$84:$H$102,MATCH($P$2,$H$84:$H$102,1))),INDEX($I$84:$M$102,MATCH($P$2,$H$84:$H$102,0),MATCH(R4,$I$83:$M$83,0)))","v":{"$error":"#N/A"}},{"$f":"IF(ISERROR(MATCH($P$2,$H$84:$H$102,0)),VLOOKUP($P$2,$H$84:$M$102,MATCH(S$4,$I$83:$M$83,0)+1,TRUE)+($P$2-VLOOKUP($P$2,$H$84:$H$102,1,TRUE))*(INDEX($I$84:$M$102,MATCH($P$2,$H$84:$H$102,1)+1,MATCH(S$4,$I$83:$M$83,0))-INDEX($I$84:$M$102,MATCH($P$2,$H$84:$H$102,1),MATCH(S$4,$I$83:$M$83,0)))/(INDEX($H$84:$H$102,MATCH($P$2,$H$84:$H$102,1)+1)-INDEX($H$84:$H$102,MATCH($P$2,$H$84:$H$102,1))),INDEX($I$84:$M$102,MATCH($P$2,$H$84:$H$102,0),MATCH(S4,$I$83:$M$83,0)))","v":{"$error":"#N/A"}},{"$f":"IF(ISERROR(MATCH($P$2,$H$84:$H$102,0)),VLOOKUP($P$2,$H$84:$M$102,MATCH(T$4,$I$83:$M$83,0)+1,TRUE)+($P$2-VLOOKUP($P$2,$H$84:$H$102,1,TRUE))*(INDEX($I$84:$M$102,MATCH($P$2,$H$84:$H$102,1)+1,MATCH(T$4,$I$83:$M$83,0))-INDEX($I$84:$M$102,MATCH($P$2,$H$84:$H$102,1),MATCH(T$4,$I$83:$M$83,0)))/(INDEX($H$84:$H$102,MATCH($P$2,$H$84:$H$102,1)+1)-INDEX($H$84:$H$102,MATCH($P$2,$H$84:$H$102,1))),INDEX($I$84:$M$102,MATCH($P$2,$H$84:$H$102,0),MATCH(T4,$I$83:$M$83,0)))","v":{"$error":"#N/A"}}]
[20,330,195,120,100,80,null,{"$f":"A85/100","v":0.2},{"$f":"+B85/1609.347","v":0.20505211119789579},0.12116715661693843,7.4564404071962104E-2,6.2137003393301755E-2,4.9709602714641407E-2]
[50,555,310,195,160,130,null,0.5,0.34486036883282473,0.19262471051923544,0.12116715661693843,9.9419205429282814E-2,8.0778104411292281E-2]
[100,860,455,285,235,180,null,1,0.53437822918239508,0.28272336543952298,0.17709045967091,0.14602195797425913,0.11184660610794316]
[200,1300,660,415,340,270,null,2,0.80778104411292284,0.41010422239579158,0.25786856408220227,0.21126581153722598,0.16776990916191475]
[300,1625,830,515,420,320,null,3,1.0097263051411536,0.51573712816440453,0.32000556747550407,0.26097541425186738,0.19883841085856563]
[400,1905,955,605,495,385,null,4,1.1837099146423984,0.59340838240603178,0.3759288705294756,0.30757816679684369,0.23922746306421175]
[500,2175,1085,680,540,405,null,5,1.3514798238043131,0.67418648681732407,0.42253162307445197,0.33553981832382951,0.2516548637428721]
[600,2470,1210,760,605,465,null,6,1.5347839838145534,0.7518577410589512,0.47224122578909333,0.3759288705294756,0.28893706577885314]
[700,2660,1320,815,660,485,null,7,1.6528442902618268,0.82020844479158317,0.50641657765540926,0.41010422239579158,0.30136446645751352]
[800,2860,1405,855,695,515,null,8,1.7771182970484303,0.87302489767588964,0.53127137901273003,0.43185217358344719,0.32000556747550407]
[900,3035,1490,935,740,550,null,9,1.8858580529867084,0.92584135056019612,0.58098098172737145,0.45981382511043301,0.34175351866315967]
[1000,3195,1595,995,780,580,null,10,1.985277258415991,0.99108520412316303,0.61826318376335243,0.48466862646775372,0.36039461968115016]
[1500,3955,2060,1235,980,725,null,15,2.4575184842050843,1.2800222699020163,0.76739199190727669,0.60894263325435716,0.45049327460143773]
[2000,4640,2420,1440,1135,835,null,20,2.8831569574492013,1.5037154821179024,0.89477284886354524,0.70525498851397495,0.5188439783340697]
[2500,5175,2710,1605,1240,870,null,25,3.215589925603366,1.6839127919584775,0.99729890446249314,0.77049884207694175,0.5405919295217253]
[3000,5690,2985,1750,1360,950,null,30,3.53559549307887,1.8547895512900574,1.0873975593827807,0.84506324614890393,0.59030153223636672]
[3500,6205,3275,1915,1455,975,null,35,{"$f":"+B101/1609.347","v":3.855601060554374},2.0349868611306325,1.1899236149817287,0.90409339937254052,0.6058357830846921]
[4000,6610,3620,2045,1565,1060,null,40,4.1072559242972462,2.2493595228375236,1.270701719393021,0.97244410310517249,0.65865223596899858]

{"sheet":"North Platte","index":9,"n_rows":93,"n_cols":20,"rows_kept":93,"cut":false,"hidden":true,"merged":[[81,1,81,5],[81,8,81,12],[3,1,3,5],[3,8,3,12],[29,1,29,5],[29,8,29,12],[55,1,55,5],[55,8,55,12]]}
["North Platte, NE-AERMOD setback distances (NE) as reported in the Odor Footprint Tool",null,null,null,null,null,null,null,null,null,null,null,null,null,"Total Scaled Odor Emission Rate (x10^6)",{"$f":"Inputs!E33","v":""}]
[null,null,null,null,null,null,null,null,null,null,null,null,null,null,"New Total Scaled Odor Emission Rate (x10^6)",{"$f":"Inputs!E42","v":""}]
["Setback Distances (m) for N. Platte, NE Direction",null,null,null,null,null,null,"Setback Distances (mi) for N. Platte, NE Direction"]
["x 104","Annoyance Free Percentage",null,null,null,null,null,"x 106","Annoyance Free Percentage",null,null,null,null,null,"Annoyance free percentage",99,98,96,94,90]
["OU/s",99,98,96,94,90,null,"OU/s",99,98,96,94,90,null,"Separation distance",{"$f":"IF(ISERROR(MATCH($P$1,$H$6:$H$24,0)),VLOOKUP($P$1,$H$6:$M$24,MATCH(P4,$I$5:$M$5,0)+1,TRUE)+($P$1-VLOOKUP($P$1,$H$6:$H$24,1,TRUE))*(INDEX($I$6:$M$24,MATCH($P$1,$H$6:$H$24,1)+1,MATCH(P4,$I$5:$M$5,0))-INDEX($I$6:$M$24,MATCH($P$1,$H$6:$H$24,1),MATCH(P4,$I$5:$M$5,0)))/(INDEX($H$6:$H$24,MATCH($P$1,$H$6:$H$24,1)+1)-INDEX($H$6:$H$24,MATCH($P$1,$H$6:$H$24,1))),INDEX($I$6:$M$24,MATCH($P$1,$H$6:$H$24,0),MATCH(P4,$I$5:$M$5,0)))","v":{"$error":"#N/A"}},{"$f":"IF(ISERROR(MATCH($P$1,$H$6:$H$24,0)),VLOOKUP($P$1,$H$6:$M$24,MATCH(Q4,$I$5:$M$5,0)+1,TRUE)+($P$1-VLOOKUP($P$1,$H$6:$H$24,1,TRUE))*(INDEX($I$6:$M$24,MATCH($P$1,$H$6:$H$24,1)+1,MATCH(Q4,$I$5:$M$5,0))-INDEX($I$6:$M$24,MATCH($P$1,$H$6:$H$24,1),MATCH(Q4,$I$5:$M$5,0)))/(INDEX($H$6:$H$24,MATCH($P$1,$H$6:$H$24,1)+1)-INDEX($H$6:$H$24,MATCH($P$1,$H$6:$H$24,1))),INDEX($I$6:$M$24,MATCH($P$1,$H$6:$H$24,0),MATCH(Q4,$I$5:$M$5,0)))","v":{"$error":"#N/A"}},{"$f":"IF(ISERROR(MATCH($P$1,$H$6:$H$24,0)),VLOOKUP($P$1,$H$6:$M$24,MATCH(R4,$I$5:$M$5,0)+1,TRUE)+($P$1-VLOOKUP($P$1,$H$6:$H$24,1,TRUE))*(INDEX($I$6:$M$24,MATCH($P$1,$H$6:$H$24,1)+1,MATCH(R4,$I$5:$M$5,0))-INDEX($I$6:$M$24,MATCH($P$1,$H$6:$H$24,1),MATCH(R4,$I$5:$M$5,0)))/(INDEX($H$6:$H$24,MATCH($P$1,$H$6:$H$24,1)+1)-INDEX($H$6:$H$24,MATCH($P$1,$H$6:$H$24,1))),INDEX($I$6:$M$24,MATCH($P$1,$H$6:$H$24,0),MATCH(R4,$I$5:$M$5,0)))","v":{"$error":"#N/A"}},{"$f":"IF(ISERROR(MATCH($P$1,$H$6:$H$24,0)),VLOOKUP($P$1,$H$6:$M$24,MATCH(S4,$I$5:$M$5,0)+1,TRUE)+($P$1-VLOOKUP($P$1,$H$6:$H$24,1,TRUE))*(INDEX($I$6:$M$24,MATCH($P$1,$H$6:$H$24,1)+1,MATCH(S4,$I$5:$M$5,0))-INDEX($I$6:$M$24,MATCH($P$1,$H$6:$H$24,1),MATCH(S4,$I$5:$M$5,0)))/(INDEX($H$6:$H$24,MATCH($P$1,$H$6:$H$24,1)+1)-INDEX($H$6:$H$24,MATCH($P$1,$H$6:$H$24,1))),INDEX($I$6:$M$24,MATCH($P$1,$H$6:$H$24,0),MATCH(S4,$I$5:$M$5,0)))","v":{"$error":"#N/A"}},{"$f":"IF(ISERROR(MATCH($P$1,$H$6:$H$24,0)),VLOOKUP($P$1,$H$6:$M$24,MATCH(T4,$I$5:$M$5,0)+1,TRUE)+($P$1-VLOOKUP($P$1,$H$6:$H$24,1,TRUE))*(INDEX($I$6:$M$24,MATCH($P$1,$H$6:$H$24,1)+1,MATCH(T4,$I$5:$M$5,0))-INDEX($I$6:$M$24,MATCH($P$1,$H$6:$H$24,1),MATCH(T4,$I$5:$M$5,0)))/(INDEX($H$6:$H$24,MATCH($P$1,$H$6:$H$24,1)+1)-INDEX($H$6:$H$24,MATCH($P$1,$H$6:$H$24,1))),INDEX($I$6:$M$24,MATCH($P$1,$H$6:$H$24,0),MATCH(T4,$I$5:$M$5,0)))","v":{"$error":"#N/A"}}]
[0,0,0,0,0,0,null,{"$f":"A6/100","v":0},0,0,0,0,0,null,"New Separation distance",{"$f":"IF(ISERROR(MATCH($P$2,$H$6:$H$24,0)),VLOOKUP($P$2,$H$6:$M$24,MATCH(P4,$I$5:$M$5,0)+1,TRUE)+($P$2-VLOOKUP($P$2,$H$6:$H$24,1,TRUE))*(INDEX($I$6:$M$24,MATCH($P$2,$H$6:$H$24,1)+1,MATCH(P4,$I$5:$M$5,0))-INDEX($I$6:$M$24,MATCH($P$2,$H$6:$H$24,1),MATCH(P4,$I$5:$M$5,0)))/(INDEX($H$6:$H$24,MATCH($P$2,$H$6:$H$24,1)+1)-INDEX($H$6:$H$24,MATCH($P$2,$H$6:$H$24,1))),INDEX($I$6:$M$24,MATCH($P$2,$H$6:$H$24,0),MATCH(P4,$I$5:$M$5,0)))","v":{"$error":"#N/A"}},{"$f":"IF(ISERROR(MATCH($P$2,$H$6:$H$24,0)),VLOOKUP($P$2,$H$6:$M$24,MATCH(Q4,$I$5:$M$5,0)+1,TRUE)+($P$2-VLOOKUP($P$2,$H$6:$H$24,1,TRUE))*(INDEX($I$6:$M$24,MATCH($P$2,$H$6:$H$24,1)+1,MATCH(Q4,$I$5:$M$5,0))-INDEX($I$6:$M$24,MATCH($P$2,$H$6:$H$24,1),MATCH(Q4,$I$5:$M$5,0)))/(INDEX($H$6:$H$24,MATCH($P$2,$H$6:$H$24,1)+1)-INDEX($H$6:$H$24,MATCH($P$2,$H$6:$H$24,1))),INDEX($I$6:$M$24,MATCH($P$2,$H$6:$H$24,0),MATCH(Q4,$I$5:$M$5,0)))","v":{"$error":"#N/A"}},{"$f":"IF(ISERROR(MATCH($P$2,$H$6:$H$24,0)),VLOOKUP($P$2,$H$6:$M$24,MATCH(R4,$I$5:$M$5,0)+1,TRUE)+($P$2-VLOOKUP($P$2,$H$6:$H$24,1,TRUE))*(INDEX($I$6:$M$24,MATCH($P$2,$H$6:$H$24,1)+1,MATCH(R4,$I$5:$M$5,0))-INDEX($I$6:$M$24,MATCH($P$2,$H$6:$H$24,1),MATCH(R4,$I$5:$M$5,0)))/(INDEX($H$6:$H$24,MATCH($P$2,$H$6:$H$24,1)+1)-INDEX($H$6:$H$24,MATCH($P$2,$H$6:$H$24,1))),INDEX($I$6:$M$24,MATCH($P$2,$H$6:$H$24,0),MATCH(R4,$I$5:$M$5,0)))","v":{"$error":"#N/A"}},{"$f":"IF(ISERROR(MATCH($P$2,$H$6:$H$24,0)),VLOOKUP($P$2,$H$6:$M$24,MATCH(S4,$I$5:$M$5,0)+1,TRUE)+($P$2-VLOOKUP($P$2,$H$6:$H$24,1,TRUE))*(INDEX($I$6:$M$24,MATCH($P$2,$H$6:$H$24,1)+1,MATCH(S4,$I$5:$M$5,0))-INDEX($I$6:$M$24,MATCH($P$2,$H$6:$H$24,1),MATCH(S4,$I$5:$M$5,0)))/(INDEX($H$6:$H$24,MATCH($P$2,$H$6:$H$24,1)+1)-INDEX($H$6:$H$24,MATCH($P$2,$H$6:$H$24,1))),INDEX($I$6:$M$24,MATCH($P$2,$H$6:$H$24,0),MATCH(S4,$I$5:$M$5,0)))","v":{"$error":"#N/A"}},{"$f":"IF(ISERROR(MATCH($P$2,$H$6:$H$24,0)),VLOOKUP($P$2,$H$6:$M$24,MATCH(T4,$I$5:$M$5,0)+1,TRUE)+($P$2-VLOOKUP($P$2,$H$6:$H$24,1,TRUE))*(INDEX($I$6:$M$24,MATCH($P$2,$H$6:$H$24,1)+1,MATCH(T4,$I$5:$M$5,0))-INDEX($I$6:$M$24,MATCH($P$2,$H$6:$H$24,1),MATCH(T4,$I$5:$M$5,0)))/(INDEX($H$6:$H$24,MATCH($P$2,$H$6:$H$24,1)+1)-INDEX($H$6:$H$24,MATCH($P$2,$H$6:$H$24,1))),INDEX($I$6:$M$24,MATCH($P$2,$H$6:$H$24,0),MATCH(T4,$I$5:$M$5,0)))","v":{"$error":"#N/A"}}]
[100,406.2,291,211,178.8,147.80000000000001,null,{"$f":"A7/100","v":1},{"$f":"+B7/1609.347","v":0.25240050778359174},0.18081867987450811,0.13110907715986669,0.11110096206722354,9.1838491015300006E-2]
[200,638.6,435.1,333.2,285.2,223.2,null,2,0.39680690366962501,0.27035810176425595,0.20704049530648144,0.17721473367769661,0.1386897915738495]
[300,789.1,520.29999999999995,380,330,260,null,3,0.49032309377654415,0.32329882865534904,0.23612061289454667,0.20505211119789579,0.16155620882258456]
[400,940,600,449.7,385.5,300,null,4,0.5840878318970365,0.37282202035981055,0.27943010425967801,0.23953814808117826,0.18641101017990527]
[500,1060,697.6,482.2,420,335.3,null,5,0.65865223596899858,0.43346773567167307,0.29962463036250109,0.26097541425186738,0.20834537237774078]
[1000,1650,1023,736.1,632.6,438.3,null,10,1.025260555989479,0.63566154471347691,0.45739048197809423,0.39307868346602692,0.2723464858728416]
[2000,2518.6999999999998,1570.7,1132.8,958.4,690,null,20,1.5650447044670912,0.97598591229859066,0.70388797443932227,0.59552104052140398,0.42874532341378213]
[3000,3130,1940,1261.9000000000001,1090.9000000000001,750.8,null,30,1.944888206210345,1.2054578658300541,0.78410684582007495,0.67785257001752897,0.46652462147690954]
[4000,3680,2210.1,1379.5,1161.9000000000001,751,null,40,2.2866417248735047,1.3732899119953621,0.85717996181059775,0.7219698424267732,0.4666488954836962]
[]
[]
[]
[]
[]
[]
[]
[]
[]
[]
[]
["North Platte, NE-AERMOD setback distances (SE) as reported in the Odor Footprint Tool"]
[]
["Setback Distances (m) for N. Platte, SE Direction",null,null,null,null,null,null,"Setback Distances (mi) for N. Platte, SE Direction"]
["x 104","Annoyance Free Percentage",null,null,null,null,null,"x 106","Annoyance Free Percentage"]
["OU/s",99,98,96,94,90,null,"OU/s",99,98,96,94,90,null,"Separation distance",{"$f":"IF(ISERROR(MATCH($P$1,$H$32:$H$50,0)),VLOOKUP($P$1,$H$32:$M$50,MATCH(P$4,$I$31:$M$31,0)+1,TRUE)+($P$1-VLOOKUP($P$1,$H$32:$H$50,1,TRUE))*(INDEX($I$32:$M$50,MATCH($P$1,$H$32:$H$50,1)+1,MATCH(P$4,$I$31:$M$31,0))-INDEX($I$32:$M$50,MATCH($P$1,$H$32:$H$50,1),MATCH(P$4,$I$31:$M$31,0)))/(INDEX($H$32:$H$50,MATCH($P$1,$H$32:$H$50,1)+1)-INDEX($H$32:$H$50,MATCH($P$1,$H$32:$H$50,1))),INDEX($I$32:$M$50,MATCH($P$1,$H$32:$H$50,0),MATCH(P4,$I$31:$M$31,0)))","v":{"$error":"#N/A"}},{"$f":"IF(ISERROR(MATCH($P$1,$H$32:$H$50,0)),VLOOKUP($P$1,$H$32:$M$50,MATCH(Q$4,$I$31:$M$31,0)+1,TRUE)+($P$1-VLOOKUP($P$1,$H$32:$H$50,1,TRUE))*(INDEX($I$32:$M$50,MATCH($P$1,$H$32:$H$50,1)+1,MATCH(Q$4,$I$31:$M$31,0))-INDEX($I$32:$M$50,MATCH($P$1,$H$32:$H$50,1),MATCH(Q$4,$I$31:$M$31,0)))/(INDEX($H$32:$H$50,MATCH($P$1,$H$32:$H$50,1)+1)-INDEX($H$32:$H$50,MATCH($P$1,$H$32:$H$50,1))),INDEX($I$32:$M$50,MATCH($P$1,$H$32:$H$50,0),MATCH(Q4,$I$31:$M$31,0)))","v":{"$error":"#N/A"}},{"$f":"IF(ISERROR(MATCH($P$1,$H$32:$H$50,0)),VLOOKUP($P$1,$H$32:$M$50,MATCH(R$4,$I$31:$M$31,0)+1,TRUE)+($P$1-VLOOKUP($P$1,$H$32:$H$50,1,TRUE))*(INDEX($I$32:$M$50,MATCH($P$1,$H$32:$H$50,1)+1,MATCH(R$4,$I$31:$M$31,0))-INDEX($I$32:$M$50,MATCH($P$1,$H$32:$H$50,1),MATCH(R$4,$I$31:$M$31,0)))/(INDEX($H$32:$H$50,MATCH($P$1,$H$32:$H$50,1)+1)-INDEX($H$32:$H$50,MATCH($P$1,$H$32:$H$50,1))),INDEX($I$32:$M$50,MATCH($P$1,$H$32:$H$50,0),MATCH(R4,$I$31:$M$31,0)))","v":{"$error":"#N/A"}},{"$f":"IF(ISERROR(MATCH($P$1,$H$32:$H$50,0)),VLOOKUP($P$1,$H$32:$M$50,MATCH(S$4,$I$31:$M$31,0)+1,TRUE)+($P$1-VLOOKUP($P$1,$H$32:$H$50,1,TRUE))*(INDEX($I$32:$M$50,MATCH($P$1,$H$32:$H$50,1)+1,MATCH(S$4,$I$31:$M$31,0))-INDEX($I$32:$M$50,MATCH($P$1,$H$32:$H$50,1),MATCH(S$4,$I$31:$M$31,0)))/(INDEX($H$32:$H$50,MATCH($P$1,$H$32:$H$50,1)+1)-INDEX($H$32:$H$50,MATCH($P$1,$H$32:$H$50,1))),INDEX($I$32:$M$50,MATCH($P$1,$H$32:$H$50,0),MATCH(S4,$I$31:$M$31,0)))","v":{"$error":"#N/A"}},{"$f":"IF(ISERROR(MATCH($P$1,$H$32:$H$50,0)),VLOOKUP($P$1,$H$32:$M$50,MATCH(T$4,$I$31:$M$31,0)+1,TRUE)+($P$1-VLOOKUP($P$1,$H$32:$H$50,1,TRUE))*(INDEX($I$32:$M$50,MATCH($P$1,$H$32:$H$50,1)+1,MATCH(T$4,$I$31:$M$31,0))-INDEX($I$32:$M$50,MATCH($P$1,$H$32:$H$50,1),MATCH(T$4,$I$31:$M$31,0)))/(INDEX($H$32:$H$50,MATCH($P$1,$H$32:$H$50,1)+1)-INDEX($H$32:$H$50,MATCH($P$1,$H$32:$H$50,1))),INDEX($I$32:$M$50,MATCH($P$1,$H$32:$H$50,0),MATCH(T4,$I$31:$M$31,0)))","v":{"$error":"#N/A"}}]
[0,0,0,0,0,0,null,{"$f":"A32/100","v":0},0,0,0,0,0,null,"New Separation distance",{"$f":"IF(ISERROR(MATCH($P$2,$H$32:$H$50,0)),VLOOKUP($P$2,$H$32:$M$50,MATCH(P$4,$I$31:$M$31,0)+1,TRUE)+($P$2-VLOOKUP($P$2,$H$32:$H$50,1,TRUE))*(INDEX($I$32:$M$50,MATCH($P$2,$H$32:$H$50,1)+1,MATCH(P$4,$I$31:$M$31,0))-INDEX($I$32:$M$50,MATCH($P$2,$H$32:$H$50,1),MATCH(P$4,$I$31:$M$31,0)))/(INDEX($H$32:$H$50,MATCH($P$2,$H$32:$H$50,1)+1)-INDEX($H$32:$H$50,MATCH($P$2,$H$32:$H$50,1))),INDEX($I$32:$M$50,MATCH($P$2,$H$32:$H$50,0),MATCH(P4,$I$31:$M$31,0)))","v":{"$error":"#N/A"}},{"$f":"IF(ISERROR(MATCH($P$2,$H$32:$H$50,0)),VLOOKUP($P$2,$H$32:$M$50,MATCH(Q$4,$I$31:$M$31,0)+1,TRUE)+($P$2-VLOOKUP($P$2,$H$32:$H$50,1,TRUE))*(INDEX($I$32:$M$50,MATCH($P$2,$H$32:$H$50,1)+1,MATCH(Q$4,$I$31:$M$31,0))-INDEX($I$32:$M$50,MATCH($P$2,$H$32:$H$50,1),MATCH(Q$4,$I$31:$M$31,0)))/(INDEX($H$32:$H$50,MATCH($P$2,$H$32:$H$50,1)+1)-INDEX($H$32:$H$50,MATCH($P$2,$H$32:$H$50,1))),INDEX($I$32:$M$50,MATCH($P$2,$H$32:$H$50,0),MATCH(Q4,$I$31:$M$31,0)))","v":{"$error":"#N/A"}},{"$f":"IF(ISERROR(MATCH($P$2,$H$32:$H$50,0)),VLOOKUP($P$2,$H$32:$M$50,MATCH(R$4,$I$31:$M$31,0)+1,TRUE)+($P$2-VLOOKUP($P$2,$H$32:$H$50,1,TRUE))*(INDEX($I$32:$M$50,MATCH($P$2,$H$32:$H$50,1)+1,MATCH(R$4,$I$31:$M$31,0))-INDEX($I$32:$M$50,MATCH($P$2,$H$32:$H$50,1),MATCH(R$4,$I$31:$M$31,0)))/(INDEX($H$32:$H$50,MATCH($P$2,$H$32:$H$50,1)+1)-INDEX($H$32:$H$50,MATCH($P$2,$H$32:$H$50,1))),INDEX($I$32:$M$50,MATCH($P$2,$H$32:$H$50,0),MATCH(R4,$I$31:$M$31,0)))","v":{"$error":"#N/A"}},{"$f":"IF(ISERROR(MATCH($P$2,$H$32:$H$50,0)),VLOOKUP($P$2,$H$32:$M$50,MATCH(S$4,$I$31:$M$31,0)+1,TRUE)+($P$2-VLOOKUP($P$2,$H$32:$H$50,1,TRUE))*(INDEX($I$32:$M$50,MATCH($P$2,$H$32:$H$50,1)+1,MATCH(S$4,$I$31:$M$31,0))-INDEX($I$32:$M$50,MATCH($P$2,$H$32:$H$50,1),MATCH(S$4,$I$31:$M$31,0)))/(INDEX($H$32:$H$50,MATCH($P$2,$H$32:$H$50,1)+1)-INDEX($H$32:$H$50,MATCH($P$2,$H$32:$H$50,1))),INDEX($I$32:$M$50,MATCH($P$2,$H$32:$H$50,0),MATCH(S4,$I$31:$M$31,0)))","v":{"$error":"#N/A"}},{"$f":"IF(ISERROR(MATCH($P$2,$H$32:$H$50,0)),VLOOKUP($P$2,$H$32:$M$50,MATCH(T$4,$I$31:$M$31,0)+1,TRUE)+($P$2-VLOOKUP($P$2,$H$32:$H$50,1,TRUE))*(INDEX($I$32:$M$50,MATCH($P$2,$H$32:$H$50,1)+1,MATCH(T$4,$I$31:$M$31,0))-INDEX($I$32:$M$50,MATCH($P$2,$H$32:$H$50,1),MATCH(T$4,$I$31:$M$31,0)))/(INDEX($H$32:$H$50,MATCH($P$2,$H$32:$H$50,1)+1)-INDEX($H$32:$H$50,MATCH($P$2,$H$32:$H$50,1))),INDEX($I$32:$M$50,MATCH($P$2,$H$32:$H$50,0),MATCH(T4,$I$31:$M$31,0)))","v":{"$error":"#N/A"}}]
[100,723.9,394.6,239.4,184.2,102.5,null,{"$f":"A33/100","v":1},{"$f":"+B33/1609.347","v":0.4498097675641114},0.24519261538996875,0.14875598612356442,0.11445636025046182,6.3690428478134303E-2]
[200,1058.5999999999999,557.20000000000005,338.8,252.3,134.5,null,2,0.65778231792149233,0.3462273829074774,0.21052016749650634,0.15677165956130035,8.3574269563990861E-2]
[300,1335.4,689.1,411.5,303,142.30000000000001,null,3,0.82977754331415166,0.4281860903832424,0.25569376896343671,0.18827512028170432,8.8420955828668407E-2]
[400,1552.8,793.7,466.1,343.4,165,null,4,0.96486338869118959,0.49318139593263605,0.28962057281617948,0.21337846965259821,0.1025260555989479]
[500,1716.3,895.9,525.5,384.8,175.5,null,5,1.0664573892392379,0.55668541340059041,0.32652995283180075,0.23910318905742517,0.10905044095524458]
[1000,2523,1256.2,720.1,489.6,185,null,10,1.5677165956130032,0.78056503662665666,0.44744856143516598,0.30422276861360542,0.11495345627760825]
[2000,3707.1,1773.4,994.2,644.20000000000005,199.9,null,20,2.3034808527930895,1.1019376181768135,0.61776608773620612,0.40028657585964994,0.12421186978321021]
[3000,4578.1000000000004,2198,1183.2,759.2,233.9,null,30,2.8446941523487479,1.3657713345847726,0.73520502414954636,0.47174412976194696,0.14533845093693282]
[4000,5341.8,2539.1,1369.5,847.5,275.7,null,40,3.3192344472633932,1.5777206531593249,0.85096626147126753,0.52661110375823239,0.17131171835533293]
[]
[]
[]
[]
[]
[]
[]
[]
[]
[]
[]
["N. Platte, NE - AERMOD setback distances (SW) as reported in the Odor Footprint Tool"]
[]
["Setback Distances (m) for N. Platte, SW Direction",null,null,null,null,null,null,"Setback Distances (mi) for N. Platte, SW Direction"]
["x 104","Annoyance Free Percentage",null,null,null,null,null,"x 106","Annoyance Free Percentage"]
["OU/s",99,98,96,94,90,null,"OU/s",99,98,96,94,90,null,"Separation distance",{"$f":"IF(ISERROR(MATCH($P$1,$H$58:$H$76,0)),VLOOKUP($P$1,$H$58:$M$76,MATCH(P$4,$I$57:$M$57,0)+1,TRUE)+($P$1-VLOOKUP($P$1,$H$58:$H$76,1,TRUE))*(INDEX($I$58:$M$76,MATCH($P$1,$H$58:$H$76,1)+1,MATCH(P$4,$I$57:$M$57,0))-INDEX($I$58:$M$76,MATCH($P$1,$H$58:$H$76,1),MATCH(P$4,$I$57:$M$57,0)))/(INDEX($H$58:$H$76,MATCH($P$1,$H$58:$H$76,1)+1)-INDEX($H$58:$H$76,MATCH($P$1,$H$58:$H$76,1))),INDEX($I$58:$M$76,MATCH($P$1,$H$58:$H$76,0),MATCH(P$4,$I$57:$M$57,0)))","v":{"$error":"#N/A"}},{"$f":"IF(ISERROR(MATCH($P$1,$H$58:$H$76,0)),VLOOKUP($P$1,$H$58:$M$76,MATCH(Q$4,$I$57:$M$57,0)+1,TRUE)+($P$1-VLOOKUP($P$1,$H$58:$H$76,1,TRUE))*(INDEX($I$58:$M$76,MATCH($P$1,$H$58:$H$76,1)+1,MATCH(Q$4,$I$57:$M$57,0))-INDEX($I$58:$M$76,MATCH($P$1,$H$58:$H$76,1),MATCH(Q$4,$I$57:$M$57,0)))/(INDEX($H$58:$H$76,MATCH($P$1,$H$58:$H$76,1)+1)-INDEX($H$58:$H$76,MATCH($P$1,$H$58:$H$76,1))),INDEX($I$58:$M$76,MATCH($P$1,$H$58:$H$76,0),MATCH(Q$4,$I$57:$M$57,0)))","v":{"$error":"#N/A"}},{"$f":"IF(ISERROR(MATCH($P$1,$H$58:$H$76,0)),VLOOKUP($P$1,$H$58:$M$76,MATCH(R$4,$I$57:$M$57,0)+1,TRUE)+($P$1-VLOOKUP($P$1,$H$58:$H$76,1,TRUE))*(INDEX($I$58:$M$76,MATCH($P$1,$H$58:$H$76,1)+1,MATCH(R$4,$I$57:$M$57,0))-INDEX($I$58:$M$76,MATCH($P$1,$H$58:$H$76,1),MATCH(R$4,$I$57:$M$57,0)))/(INDEX($H$58:$H$76,MATCH($P$1,$H$58:$H$76,1)+1)-INDEX($H$58:$H$76,MATCH($P$1,$H$58:$H$76,1))),INDEX($I$58:$M$76,MATCH($P$1,$H$58:$H$76,0),MATCH(R$4,$I$57:$M$57,0)))","v":{"$error":"#N/A"}},{"$f":"IF(ISERROR(MATCH($P$1,$H$58:$H$76,0)),VLOOKUP($P$1,$H$58:$M$76,MATCH(S$4,$I$57:$M$57,0)+1,TRUE)+($P$1-VLOOKUP($P$1,$H$58:$H$76,1,TRUE))*(INDEX($I$58:$M$76,MATCH($P$1,$H$58:$H$76,1)+1,MATCH(S$4,$I$57:$M$57,0))-INDEX($I$58:$M$76,MATCH($P$1,$H$58:$H$76,1),MATCH(S$4,$I$57:$M$57,0)))/(INDEX($H$58:$H$76,MATCH($P$1,$H$58:$H$76,1)+1)-INDEX($H$58:$H$76,MATCH($P$1,$H$58:$H$76,1))),INDEX($I$58:$M$76,MATCH($P$1,$H$58:$H$76,0),MATCH(S$4,$I$57:$M$57,0)))","v":{"$error":"#N/A"}},{"$f":"IF(ISERROR(MATCH($P$1,$H$58:$H$76,0)),VLOOKUP($P$1,$H$58:$M$76,MATCH(T$4,$I$57:$M$57,0)+1,TRUE)+($P$1-VLOOKUP($P$1,$H$58:$H$76,1,TRUE))*(INDEX($I$58:$M$76,MATCH($P$1,$H$58:$H$76,1)+1,MATCH(T$4,$I$57:$M$57,0))-INDEX($I$58:$M$76,MATCH($P$1,$H$58:$H$76,1),MATCH(T$4,$I$57:$M$57,0)))/(INDEX($H$58:$H$76,MATCH($P$1,$H$58:$H$76,1)+1)-INDEX($H$58:$H$76,MATCH($P$1,$H$58:$H$76,1))),INDEX($I$58:$M$76,MATCH($P$1,$H$58:$H$76,0),MATCH(T$4,$I$57:$M$57,0)))","v":{"$error":"#N/A"}}]
[0,0,0,0,0,0,null,{"$f":"A58/100","v":0},0,0,0,0,0,null,"New Separation distance",{"$f":"IF(ISERROR(MATCH($P$2,$H$58:$H$76,0)),VLOOKUP($P$2,$H$58:$M$76,MATCH(P$4,$I$57:$M$57,0)+1,TRUE)+($P$2-VLOOKUP($P$2,$H$58:$H$76,1,TRUE))*(INDEX($I$58:$M$76,MATCH($P$2,$H$58:$H$76,1)+1,MATCH(P$4,$I$57:$M$57,0))-INDEX($I$58:$M$76,MATCH($P$2,$H$58:$H$76,1),MATCH(P$4,$I$57:$M$57,0)))/(INDEX($H$58:$H$76,MATCH($P$2,$H$58:$H$76,1)+1)-INDEX($H$58:$H$76,MATCH($P$2,$H$58:$H$76,1))),INDEX($I$58:$M$76,MATCH($P$2,$H$58:$H$76,0),MATCH(P4,$I$57:$M$57,0)))","v":{"$error":"#N/A"}},{"$f":"IF(ISERROR(MATCH($P$2,$H$58:$H$76,0)),VLOOKUP($P$2,$H$58:$M$76,MATCH(Q$4,$I$57:$M$57,0)+1,TRUE)+($P$2-VLOOKUP($P$2,$H$58:$H$76,1,TRUE))*(INDEX($I$58:$M$76,MATCH($P$2,$H$58:$H$76,1)+1,MATCH(Q$4,$I$57:$M$57,0))-INDEX($I$58:$M$76,MATCH($P$2,$H$58:$H$76,1),MATCH(Q$4,$I$57:$M$57,0)))/(INDEX($H$58:$H$76,MATCH($P$2,$H$58:$H$76,1)+1)-INDEX($H$58:$H$76,MATCH($P$2,$H$58:$H$76,1))),INDEX($I$58:$M$76,MATCH($P$2,$H$58:$H$76,0),MATCH(Q4,$I$57:$M$57,0)))","v":{"$error":"#N/A"}},{"$f":"IF(ISERROR(MATCH($P$2,$H$58:$H$76,0)),VLOOKUP($P$2,$H$58:$M$76,MATCH(R$4,$I$57:$M$57,0)+1,TRUE)+($P$2-VLOOKUP($P$2,$H$58:$H$76,1,TRUE))*(INDEX($I$58:$M$76,MATCH($P$2,$H$58:$H$76,1)+1,MATCH(R$4,$I$57:$M$57,0))-INDEX($I$58:$M$76,MATCH($P$2,$H$58:$H$76,1),MATCH(R$4,$I$57:$M$57,0)))/(INDEX($H$58:$H$76,MATCH($P$2,$H$58:$H$76,1)+1)-INDEX($H$58:$H$76,MATCH($P$2,$H$58:$H$76,1))),INDEX($I$58:$M$76,MATCH($P$2,$H$58:$H$76,0),MATCH(R4,$I$57:$M$57,0)))","v":{"$error":"#N/A"}},{"$f":"IF(ISERROR(MATCH($P$2,$H$58:$H$76,0)),VLOOKUP($P$2,$H$58:$M$76,MATCH(S$4,$I$57:$M$57,0)+1,TRUE)+($P$2-VLOOKUP($P$2,$H$58:$H$76,1,TRUE))*(INDEX($I$58:$M$76,MATCH($P$2,$H$58:$H$76,1)+1,MATCH(S$4,$I$57:$M$57,0))-INDEX($I$58:$M$76,MATCH($P$2,$H$58:$H$76,1),MATCH(S$4,$I$57:$M$57,0)))/(INDEX($H$58:$H$76,MATCH($P$2,$H$58:$H$76,1)+1)-INDEX($H$58:$H$76,MATCH($P$2,$H$58:$H$76,1))),INDEX($I$58:$M$76,MATCH($P$2,$H$58:$H$76,0),MATCH(S4,$I$57:$M$57,0)))","v":{"$error":"#N/A"}},{"$f":"IF(ISERROR(MATCH($P$2,$H$58:$H$76,0)),VLOOKUP($P$2,$H$58:$M$76,MATCH(T$4,$I$57:$M$57,0)+1,TRUE)+($P$2-VLOOKUP($P$2,$H$58:$H$76,1,TRUE))*(INDEX($I$58:$M$76,MATCH($P$2,$H$58:$H$76,1)+1,MATCH(T$4,$I$57:$M$57,0))-INDEX($I$58:$M$76,MATCH($P$2,$H$58:$H$76,1),MATCH(T$4,$I$57:$M$57,0)))/(INDEX($H$58:$H$76,MATCH($P$2,$H$58:$H$76,1)+1)-INDEX($H$58:$H$76,MATCH($P$2,$H$58:$H$76,1))),INDEX($I$58:$M$76,MATCH($P$2,$H$58:$H$76,0),MATCH(T4,$I$57:$M$57,0)))","v":{"$error":"#N/A"}}]
[100,612.6,387.5,238,200,125.4,null,{"$f":"A59/100","v":1},{"$f":"+B59/1609.347","v":0.3806512827873666},0.2407808881490443,0.14788606807605817,0.12427400678660351,7.7919802255200399E-2]
[200,880.8,540.29999999999995,321.39999999999998,265.3,156.30000000000001,null,2,0.54730272588820184,0.33572622933400936,0.19970832890607182,0.16484947000242955,9.7120136303730648E-2]
[300,1134.2,669.8,420,322.10000000000002,194.8,null,3,0.70475789248682852,0.41619364872833514,0.26097541425186738,0.20014328792982497,0.12104288261015182]
[400,1350,760,471.3,380.3,202.3,null,4,0.83884954580957372,0.47224122578909333,0.29285169699263119,0.23630702390472658,0.12570315786464947]
[500,1517.3,871,536.79999999999995,432.5,226,null,5,0.94280475248656748,0.54121329955565833,0.3335514342152438,0.26874253967603007,0.14042962766886197]
[1000,2304.1,1355,840,582.6,325,null,10,1.4316986951850657,0.84195639597923877,0.52195082850373475,0.36201018176937605,0.20194526102823071]
[2000,3520.2,1898.2,1127.8,743.2,359.4,null,20,2.1873467934510082,1.179484598411654,0.70078112426965722,0.46180220921901866,0.22332039019552649]
[3000,4467.3,2331.1999999999998,1311,802.7,400,null,30,2.7758463525889696,1.4485378231046504,0.81461611448618598,0.49877372623803323,0.24854801357320702]
[4000,5306.1,2867.7,1657.5,1052.5999999999999,449.4,null,40,3.2970515370519848,1.7819028463097144,1.0299208312439767,0.65405409771789425,0.2792436932494981]
[]
[]
[]
[]
[]
[]
[]
[]
[]
[]
[]
["North Platte, NE - AERMOD setback distances (NW) as reported in the Odor Footprint Tool"]
[]
["Setback Distances (m) for N. Platte, NW Direction",null,null,null,null,null,null,"Setback Distances (mi) for N. Platte, NW Direction"]
["x 104","Annoyance Free Percentage",null,null,null,null,null,"x 106","Annoyance Free Percentage"]
["OU/s",99,98,96,94,90,null,"OU/s",99,98,96,94,90,null,"Separation distance",{"$f":"IF(ISERROR(MATCH($P$1,$H$84:$H$102,0)),VLOOKUP($P$1,$H$84:$M$102,MATCH(P$4,$I$83:$M$83,0)+1,TRUE)+($P$1-VLOOKUP($P$1,$H$84:$H$102,1,TRUE))*(INDEX($I$84:$M$102,MATCH($P$1,$H$84:$H$102,1)+1,MATCH(P$4,$I$83:$M$83,0))-INDEX($I$84:$M$102,MATCH($P$1,$H$84:$H$102,1),MATCH(P$4,$I$83:$M$83,0)))/(INDEX($H$84:$H$102,MATCH($P$1,$H$84:$H$102,1)+1)-INDEX($H$84:$H$102,MATCH($P$1,$H$84:$H$102,1))),INDEX($I$84:$M$102,MATCH($P$1,$H$84:$H$102,0),MATCH(P4,$I$83:$M$83,0)))","v":{"$error":"#N/A"}},{"$f":"IF(ISERROR(MATCH($P$1,$H$84:$H$102,0)),VLOOKUP($P$1,$H$84:$M$102,MATCH(Q$4,$I$83:$M$83,0)+1,TRUE)+($P$1-VLOOKUP($P$1,$H$84:$H$102,1,TRUE))*(INDEX($I$84:$M$102,MATCH($P$1,$H$84:$H$102,1)+1,MATCH(Q$4,$I$83:$M$83,0))-INDEX($I$84:$M$102,MATCH($P$1,$H$84:$H$102,1),MATCH(Q$4,$I$83:$M$83,0)))/(INDEX($H$84:$H$102,MATCH($P$1,$H$84:$H$102,1)+1)-INDEX($H$84:$H$102,MATCH($P$1,$H$84:$H$102,1))),INDEX($I$84:$M$102,MATCH($P$1,$H$84:$H$102,0),MATCH(Q4,$I$83:$M$83,0)))","v":{"$error":"#N/A"}},{"$f":"IF(ISERROR(MATCH($P$1,$H$84:$H$102,0)),VLOOKUP($P$1,$H$84:$M$102,MATCH(R$4,$I$83:$M$83,0)+1,TRUE)+($P$1-VLOOKUP($P$1,$H$84:$H$102,1,TRUE))*(INDEX($I$84:$M$102,MATCH($P$1,$H$84:$H$102,1)+1,MATCH(R$4,$I$83:$M$83,0))-INDEX($I$84:$M$102,MATCH($P$1,$H$84:$H$102,1),MATCH(R$4,$I$83:$M$83,0)))/(INDEX($H$84:$H$102,MATCH($P$1,$H$84:$H$102,1)+1)-INDEX($H$84:$H$102,MATCH($P$1,$H$84:$H$102,1))),INDEX($I$84:$M$102,MATCH($P$1,$H$84:$H$102,0),MATCH(R4,$I$83:$M$83,0)))","v":{"$error":"#N/A"}},{"$f":"IF(ISERROR(MATCH($P$1,$H$84:$H$102,0)),VLOOKUP($P$1,$H$84:$M$102,MATCH(S$4,$I$83:$M$83,0)+1,TRUE)+($P$1-VLOOKUP($P$1,$H$84:$H$102,1,TRUE))*(INDEX($I$84:$M$102,MATCH($P$1,$H$84:$H$102,1)+1,MATCH(S$4,$I$83:$M$83,0))-INDEX($I$84:$M$102,MATCH($P$1,$H$84:$H$102,1),MATCH(S$4,$I$83:$M$83,0)))/(INDEX($H$84:$H$102,MATCH($P$1,$H$84:$H$102,1)+1)-INDEX($H$84:$H$102,MATCH($P$1,$H$84:$H$102,1))),INDEX($I$84:$M$102,MATCH($P$1,$H$84:$H$102,0),MATCH(S4,$I$83:$M$83,0)))","v":{"$error":"#N/A"}},{"$f":"IF(ISERROR(MATCH($P$1,$H$84:$H$102,0)),VLOOKUP($P$1,$H$84:$M$102,MATCH(T$4,$I$83:$M$83,0)+1,TRUE)+($P$1-VLOOKUP($P$1,$H$84:$H$102,1,TRUE))*(INDEX($I$84:$M$102,MATCH($P$1,$H$84:$H$102,1)+1,MATCH(T$4,$I$83:$M$83,0))-INDEX($I$84:$M$102,MATCH($P$1,$H$84:$H$102,1),MATCH(T$4,$I$83:$M$83,0)))/(INDEX($H$84:$H$102,MATCH($P$1,$H$84:$H$102,1)+1)-INDEX($H$84:$H$102,MATCH($P$1,$H$84:$H$102,1))),INDEX($I$84:$M$102,MATCH($P$1,$H$84:$H$102,0),MATCH(T4,$I$83:$M$83,0)))","v":{"$error":"#N/A"}}]
[0,0,0,0,0,0,null,{"$f":"A84/100","v":0},0,0,0,0,0,null,"New Separation distance",{"$f":"IF(ISERROR(MATCH($P$2,$H$84:$H$102,0)),VLOOKUP($P$2,$H$84:$M$102,MATCH(P$4,$I$83:$M$83,0)+1,TRUE)+($P$2-VLOOKUP($P$2,$H$84:$H$102,1,TRUE))*(INDEX($I$84:$M$102,MATCH($P$2,$H$84:$H$102,1)+1,MATCH(P$4,$I$83:$M$83,0))-INDEX($I$84:$M$102,MATCH($P$2,$H$84:$H$102,1),MATCH(P$4,$I$83:$M$83,0)))/(INDEX($H$84:$H$102,MATCH($P$2,$H$84:$H$102,1)+1)-INDEX($H$84:$H$102,MATCH($P$2,$H$84:$H$102,1))),INDEX($I$84:$M$102,MATCH($P$2,$H$84:$H$102,0),MATCH(P4,$I$83:$M$83,0)))","v":{"$error":"#N/A"}},{"$f":"IF(ISERROR(MATCH($P$2,$H$84:$H$102,0)),VLOOKUP($P$2,$H$84:$M$102,MATCH(Q$4,$I$83:$M$83,0)+1,TRUE)+($P$2-VLOOKUP($P$2,$H$84:$H$102,1,TRUE))*(INDEX($I$84:$M$102,MATCH($P$2,$H$84:$H$102,1)+1,MATCH(Q$4,$I$83:$M$83,0))-INDEX($I$84:$M$102,MATCH($P$2,$H$84:$H$102,1),MATCH(Q$4,$I$83:$M$83,0)))/(INDEX($H$84:$H$102,MATCH($P$2,$H$84:$H$102,1)+1)-INDEX($H$84:$H$102,MATCH($P$2,$H$84:$H$102,1))),INDEX($I$84:$M$102,MATCH($P$2,$H$84:$H$102,0),MATCH(Q4,$I$83:$M$83,0)))","v":{"$error":"#N/A"}},{"$f":"IF(ISERROR(MATCH($P$2,$H$84:$H$102,0)),VLOOKUP($P$2,$H$84:$M$102,MATCH(R$4,$I$83:$M$83,0)+1,TRUE)+($P$2-VLOOKUP($P$2,$H$84:$H$102,1,TRUE))*(INDEX($I$84:$M$102,MATCH($P$2,$H$84:$H$102,1)+1,MATCH(R$4,$I$83:$M$83,0))-INDEX($I$84:$M$102,MATCH($P$2,$H$84:$H$102,1),MATCH(R$4,$I$83:$M$83,0)))/(INDEX($H$84:$H$102,MATCH($P$2,$H$84:$H$102,1)+1)-INDEX($H$84:$H$102,MATCH($P$2,$H$84:$H$102,1))),INDEX($I$84:$M$102,MATCH($P$2,$H$84:$H$102,0),MATCH(R4,$I$83:$M$83,0)))","v":{"$error":"#N/A"}},{"$f":"IF(ISERROR(MATCH($P$2,$H$84:$H$102,0)),VLOOKUP($P$2,$H$84:$M$102,MATCH(S$4,$I$83:$M$83,0)+1,TRUE)+($P$2-VLOOKUP($P$2,$H$84:$H$102,1,TRUE))*(INDEX($I$84:$M$102,MATCH($P$2,$H$84:$H$102,1)+1,MATCH(S$4,$I$83:$M$83,0))-INDEX($I$84:$M$102,MATCH($P$2,$H$84:$H$102,1),MATCH(S$4,$I$83:$M$83,0)))/(INDEX($H$84:$H$102,MATCH($P$2,$H$84:$H$102,1)+1)-INDEX($H$84:$H$102,MATCH($P$2,$H$84:$H$102,1))),INDEX($I$84:$M$102,MATCH($P$2,$H$84:$H$102,0),MATCH(S4,$I$83:$M$83,0)))","v":{"$error":"#N/A"}},{"$f":"IF(ISERROR(MATCH($P$2,$H$84:$H$102,0)),VLOOKUP($P$2,$H$84:$M$102,MATCH(T$4,$I$83:$M$83,0)+1,TRUE)+($P$2-VLOOKUP($P$2,$H$84:$H$102,1,TRUE))*(INDEX($I$84:$M$102,MATCH($P$2,$H$84:$H$102,1)+1,MATCH(T$4,$I$83:$M$83,0))-INDEX($I$84:$M$102,MATCH($P$2,$H$84:$H$102,1),MATCH(T$4,$I$83:$M$83,0)))/(INDEX($H$84:$H$102,MATCH($P$2,$H$84:$H$102,1)+1)-INDEX($H$84:$H$102,MATCH($P$2,$H$84:$H$102,1))),INDEX($I$84:$M$102,MATCH($P$2,$H$84:$H$102,0),MATCH(T4,$I$83:$M$83,0)))","v":{"$error":"#N/A"}}]
[100,716.4,461.1,301,236.7,167.7,null,{"$f":"A85/100","v":1},{"$f":"+B85/1609.347","v":0.44514949230961376},0.28651372264651442,0.18703238021383828,0.14707828703194525,0.10420375469056704]
[200,1099.5999999999999,717.3,437.5,341.8,234.1,null,2,0.68325848931274602,0.44570872534015349,0.27184938984569518,0.21238427759830542,0.1454627249437194]
[300,1379.3,885.9,547.5,424.5,291,null,3,0.85705568780381114,0.55047171306126019,0.34020009357832709,0.26377157940456597,0.18081867987450811]
[400,1646.3,1063.9000000000001,650.29999999999995,486.5,340.6,null,4,1.0229614868639267,0.66107557910133741,0.40407693306664128,0.30229652150841302,0.2116386335575858]
[500,1848.2,1161.2,728.5,545,381.4,null,5,1.148416096715003,0.72153488340301997,0.45266806972020329,0.33864666849349456,0.23699053094205288]
[1000,2806.9,1750.2,1057.8,775.7,524.4,null,10,1.7441235482465871,1.0875218333895673,0.65728522189434591,0.48199673532184173,0.32584644579447442]
[2000,4281,2655.1,1573.2,1087.5999999999999,668.7,null,20,2.6600851152672482,1.6497995770955549,0.97753933738342325,0.67580204890554985,0.41551014169100886]
[3000,5419.9,3398.5,1951.4,1310.0999999999999,913.7,null,30,3.3677634469135618,2.1117260603213603,1.2125414842168905,0.81405688145564625,0.56774580000459818]
[4000,6466.8,3934.5,2162.8000000000002,1514.2,989.7,null,40,4.0182757354380385,2.4447803985094576,1.3438991093903305,0.94087850538137519,0.61496992258350747]

{"sheet":"Alliance","index":10,"n_rows":102,"n_cols":20,"rows_kept":102,"cut":false,"hidden":true,"merged":[[81,1,81,5],[81,8,81,12],[3,1,3,5],[3,8,3,12],[29,1,29,5],[29,8,29,12],[55,1,55,5],[55,8,55,12]]}
["Alliance, NE-AERMOD setback distances (N) as reported in the Odor Footprint Tool",null,null,null,null,null,null,null,null,null,null,null,null,null,"Total Scaled Odor Emission Rate (x10^6)",{"$f":"Inputs!E33","v":""}]
[null,null,null,null,null,null,null,null,null,null,null,null,null,null,"New Total Scaled Odor Emission Rate (x10^6)",{"$f":"Inputs!E42","v":""}]
["Setback Distances (m) N Direction",null,null,null,null,null,null,"Setback Distances (mi) N Direction"]
["x 104","Annoyance Free Percentage",null,null,null,null,null,"x 106","Annoyance Free Percentage",null,null,null,null,null,"Annoyance free percentage",99,98,96,94,90]
["OU/s",99,98,96,94,90,null,"OU/s",99,98,96,94,90,null,"Separation distance",{"$f":"IF(ISERROR(MATCH($P$1,$H$6:$H$24,0)),VLOOKUP($P$1,$H$6:$M$24,MATCH(P4,$I$5:$M$5,0)+1,TRUE)+($P$1-VLOOKUP($P$1,$H$6:$H$24,1,TRUE))*(INDEX($I$6:$M$24,MATCH($P$1,$H$6:$H$24,1)+1,MATCH(P4,$I$5:$M$5,0))-INDEX($I$6:$M$24,MATCH($P$1,$H$6:$H$24,1),MATCH(P4,$I$5:$M$5,0)))/(INDEX($H$6:$H$24,MATCH($P$1,$H$6:$H$24,1)+1)-INDEX($H$6:$H$24,MATCH($P$1,$H$6:$H$24,1))),INDEX($I$6:$M$24,MATCH($P$1,$H$6:$H$24,0),MATCH(P4,$I$5:$M$5,0)))","v":{"$error":"#N/A"}},{"$f":"IF(ISERROR(MATCH($P$1,$H$6:$H$24,0)),VLOOKUP($P$1,$H$6:$M$24,MATCH(Q4,$I$5:$M$5,0)+1,TRUE)+($P$1-VLOOKUP($P$1,$H$6:$H$24,1,TRUE))*(INDEX($I$6:$M$24,MATCH($P$1,$H$6:$H$24,1)+1,MATCH(Q4,$I$5:$M$5,0))-INDEX($I$6:$M$24,MATCH($P$1,$H$6:$H$24,1),MATCH(Q4,$I$5:$M$5,0)))/(INDEX($H$6:$H$24,MATCH($P$1,$H$6:$H$24,1)+1)-INDEX($H$6:$H$24,MATCH($P$1,$H$6:$H$24,1))),INDEX($I$6:$M$24,MATCH($P$1,$H$6:$H$24,0),MATCH(Q4,$I$5:$M$5,0)))","v":{"$error":"#N/A"}},{"$f":"IF(ISERROR(MATCH($P$1,$H$6:$H$24,0)),VLOOKUP($P$1,$H$6:$M$24,MATCH(R4,$I$5:$M$5,0)+1,TRUE)+($P$1-VLOOKUP($P$1,$H$6:$H$24,1,TRUE))*(INDEX($I$6:$M$24,MATCH($P$1,$H$6:$H$24,1)+1,MATCH(R4,$I$5:$M$5,0))-INDEX($I$6:$M$24,MATCH($P$1,$H$6:$H$24,1),MATCH(R4,$I$5:$M$5,0)))/(INDEX($H$6:$H$24,MATCH($P$1,$H$6:$H$24,1)+1)-INDEX($H$6:$H$24,MATCH($P$1,$H$6:$H$24,1))),INDEX($I$6:$M$24,MATCH($P$1,$H$6:$H$24,0),MATCH(R4,$I$5:$M$5,0)))","v":{"$error":"#N/A"}},{"$f":"IF(ISERROR(MATCH($P$1,$H$6:$H$24,0)),VLOOKUP($P$1,$H$6:$M$24,MATCH(S4,$I$5:$M$5,0)+1,TRUE)+($P$1-VLOOKUP($P$1,$H$6:$H$24,1,TRUE))*(INDEX($I$6:$M$24,MATCH($P$1,$H$6:$H$24,1)+1,MATCH(S4,$I$5:$M$5,0))-INDEX($I$6:$M$24,MATCH($P$1,$H$6:$H$24,1),MATCH(S4,$I$5:$M$5,0)))/(INDEX($H$6:$H$24,MATCH($P$1,$H$6:$H$24,1)+1)-INDEX($H$6:$H$24,MATCH($P$1,$H$6:$H$24,1))),INDEX($I$6:$M$24,MATCH($P$1,$H$6:$H$24,0),MATCH(S4,$I$5:$M$5,0)))","v":{"$error":"#N/A"}},{"$f":"IF(ISERROR(MATCH($P$1,$H$6:$H$24,0)),VLOOKUP($P$1,$H$6:$M$24,MATCH(T4,$I$5:$M$5,0)+1,TRUE)+($P$1-VLOOKUP($P$1,$H$6:$H$24,1,TRUE))*(INDEX($I$6:$M$24,MATCH($P$1,$H$6:$H$24,1)+1,MATCH(T4,$I$5:$M$5,0))-INDEX($I$6:$M$24,MATCH($P$1,$H$6:$H$24,1),MATCH(T4,$I$5:$M$5,0)))/(INDEX($H$6:$H$24,MATCH($P$1,$H$6:$H$24,1)+1)-INDEX($H$6:$H$24,MATCH($P$1,$H$6:$H$24,1))),INDEX($I$6:$M$24,MATCH($P$1,$H$6:$H$24,0),MATCH(T4,$I$5:$M$5,0)))","v":{"$error":"#N/A"}}]
[0,0,0,0,0,0,null,{"$f":"A6/100","v":0},0,0,0,0,0,null,"New Separation distance",{"$f":"IF(ISERROR(MATCH($P$2,$H$6:$H$24,0)),VLOOKUP($P$2,$H$6:$M$24,MATCH(P4,$I$5:$M$5,0)+1,TRUE)+($P$2-VLOOKUP($P$2,$H$6:$H$24,1,TRUE))*(INDEX($I$6:$M$24,MATCH($P$2,$H$6:$H$24,1)+1,MATCH(P4,$I$5:$M$5,0))-INDEX($I$6:$M$24,MATCH($P$2,$H$6:$H$24,1),MATCH(P4,$I$5:$M$5,0)))/(INDEX($H$6:$H$24,MATCH($P$2,$H$6:$H$24,1)+1)-INDEX($H$6:$H$24,MATCH($P$2,$H$6:$H$24,1))),INDEX($I$6:$M$24,MATCH($P$2,$H$6:$H$24,0),MATCH(P4,$I$5:$M$5,0)))","v":{"$error":"#N/A"}},{"$f":"IF(ISERROR(MATCH($P$2,$H$6:$H$24,0)),VLOOKUP($P$2,$H$6:$M$24,MATCH(Q4,$I$5:$M$5,0)+1,TRUE)+($P$2-VLOOKUP($P$2,$H$6:$H$24,1,TRUE))*(INDEX($I$6:$M$24,MATCH($P$2,$H$6:$H$24,1)+1,MATCH(Q4,$I$5:$M$5,0))-INDEX($I$6:$M$24,MATCH($P$2,$H$6:$H$24,1),MATCH(Q4,$I$5:$M$5,0)))/(INDEX($H$6:$H$24,MATCH($P$2,$H$6:$H$24,1)+1)-INDEX($H$6:$H$24,MATCH($P$2,$H$6:$H$24,1))),INDEX($I$6:$M$24,MATCH($P$2,$H$6:$H$24,0),MATCH(Q4,$I$5:$M$5,0)))","v":{"$error":"#N/A"}},{"$f":"IF(ISERROR(MATCH($P$2,$H$6:$H$24,0)),VLOOKUP($P$2,$H$6:$M$24,MATCH(R4,$I$5:$M$5,0)+1,TRUE)+($P$2-VLOOKUP($P$2,$H$6:$H$24,1,TRUE))*(INDEX($I$6:$M$24,MATCH($P$2,$H$6:$H$24,1)+1,MATCH(R4,$I$5:$M$5,0))-INDEX($I$6:$M$24,MATCH($P$2,$H$6:$H$24,1),MATCH(R4,$I$5:$M$5,0)))/(INDEX($H$6:$H$24,MATCH($P$2,$H$6:$H$24,1)+1)-INDEX($H$6:$H$24,MATCH($P$2,$H$6:$H$24,1))),INDEX($I$6:$M$24,MATCH($P$2,$H$6:$H$24,0),MATCH(R4,$I$5:$M$5,0)))","v":{"$error":"#N/A"}},{"$f":"IF(ISERROR(MATCH($P$2,$H$6:$H$24,0)),VLOOKUP($P$2,$H$6:$M$24,MATCH(S4,$I$5:$M$5,0)+1,TRUE)+($P$2-VLOOKUP($P$2,$H$6:$H$24,1,TRUE))*(INDEX($I$6:$M$24,MATCH($P$2,$H$6:$H$24,1)+1,MATCH(S4,$I$5:$M$5,0))-INDEX($I$6:$M$24,MATCH($P$2,$H$6:$H$24,1),MATCH(S4,$I$5:$M$5,0)))/(INDEX($H$6:$H$24,MATCH($P$2,$H$6:$H$24,1)+1)-INDEX($H$6:$H$24,MATCH($P$2,$H$6:$H$24,1))),INDEX($I$6:$M$24,MATCH($P$2,$H$6:$H$24,0),MATCH(S4,$I$5:$M$5,0)))","v":{"$error":"#N/A"}},{"$f":"IF(ISERROR(MATCH($P$2,$H$6:$H$24,0)),VLOOKUP($P$2,$H$6:$M$24,MATCH(T4,$I$5:$M$5,0)+1,TRUE)+($P$2-VLOOKUP($P$2,$H$6:$H$24,1,TRUE))*(INDEX($I$6:$M$24,MATCH($P$2,$H$6:$H$24,1)+1,MATCH(T4,$I$5:$M$5,0))-INDEX($I$6:$M$24,MATCH($P$2,$H$6:$H$24,1),MATCH(T4,$I$5:$M$5,0)))/(INDEX($H$6:$H$24,MATCH($P$2,$H$6:$H$24,1)+1)-INDEX($H$6:$H$24,MATCH($P$2,$H$6:$H$24,1))),INDEX($I$6:$M$24,MATCH($P$2,$H$6:$H$24,0),MATCH(T4,$I$5:$M$5,0)))","v":{"$error":"#N/A"}}]
[20,221.2,157.30000000000001,112.5,94.2,76.5,null,{"$f":"A7/100","v":0.2},{"$f":"+B7/1609.347","v":0.13744705150598346},{"$f":"+C7/1609.347","v":9.7741506337663667E-2},{"$f":"+D7/1609.347","v":6.9904128817464481E-2},{"$f":"+E7/1609.347","v":5.8533057196490254E-2},{"$f":"+F7/1609.347","v":4.753480759587584E-2}]
[50,387.2,265.2,184.6,153.5,123,null,0.5,{"$f":"+B8/1609.347","v":0.24059447713886439},{"$f":"+C8/1609.347","v":0.16478733299903625},{"$f":"+D8/1609.347","v":0.11470490826403504},{"$f":"+E8/1609.347","v":9.5380300208718197E-2},{"$f":"+F8/1609.347","v":7.6428514173761161E-2}]
[100,584,394,268.5,221.1,176,null,1,0.36288009981688224,0.24481979336960891,0.1668378541110152,0.13738491450259019,0.10936112597221109]
[200,884.1,584.4,389.4,318.2,249.4,null,2,0.54935324700018084,0.36312864783045545,0.24196149121351701,0.19771994479748617,0.15496968646289458]
[300,1123.0999999999999,734.1,485.2,393.5,304.8,null,3,0.69786068511017196,0.45614774191022822,0.30148874046430013,0.24450910835264242,0.18939358634278375]
[400,1332.9,865.2,567.79999999999995,456,351.1,null,4,0.82822411822931918,0.53760935335884685,0.35281390526716733,0.28334473547345601,0.21816301891388248]
[500,1522.6,988.9,642.9,511.9,391.7,null,5,0.94609801366641244,0.61447282655636104,0.399478794815537,0.31807932037031167,0.24339064229156296]
[600,1702.5,1098,704.8,562.79999999999995,427.4,null,6,1.0578824827709623,0.68226429725845328,0.43794159991599074,0.34970705509750227,0.26557355250297171]
[700,1867.3,1198.5999999999999,767.5,609.29999999999995,460.4,null,7,1.1602842643631237,0.74477412267211485,0.47690150104359097,0.37860076167538759,0.28607876362276125]
[800,2013.2,1286.2,822.8,654.4,489.7,null,8,1.250942152313951,0.79920613764464721,0.51126326392008681,0.40662455020576665,0.30428490561699867]
[900,2155.5,1383.5,872.5,693.3,517.9,null,9,1.3393631081426194,0.85966544194632977,0.54214535460655777,0.43079584452576103,0.32180754057390976]
[1000,2283.6999999999998,1463.6,923.4,733.8,543.79999999999995,null,10,1.419022746492832,0.90943718166436449,0.57377308933374838,0.45596133090004826,0.33790102445277492]
[1500,2903,1860.5,1140.5999999999999,897.7,654.9,null,15,1.80383720850755,1.1560589481323791,0.70873466070399982,0.55780387946166987,0.40693523522273317]
[2000,3357.5,2175,1326.9,1036.9000000000001,746.4,null,20,2.0862498889301064,1.3514798238043131,0.8244958980257211,0.64429858818514596,0.46379059332760431]
[2500,3846.9,2480.1,1487.1,1158.9000000000001,819.6,null,25,2.3903483835369252,1.5410598211572768,0.92403937746179032,0.7201057323249741,0.50927487981150121]
[3000,4364.3999999999996,2753.7,1641.8,1272.8,887.3,null,30,2.7119073760972614,1.7110666624413504,1.0201653217112283,0.79087977918994468,0.55134163110876644]
[3500,4801.7,3002.6,1775.4,1371.8,944.7,null,35,2.9836324919361705,1.8657256638872786,1.1031803582446795,0.8523954125493135,0.58700827105652176]
[4000,5206.5,3229.4,1908.9,1462.6,997.7,null,40,3.2351630816722561,2.0066523875832871,1.1861332577747372,0.90881581163043146,0.61994088285497162]
[]
[]
["Alliance, NE-AERMOD setback distances (E) as reported in the Odor Footprint Tool"]
[]
["Setback Distances (m) E Direction",null,null,null,null,null,null,"Setback Distances (mi)  E Direction"]
["x 104","Annoyance Free Percentage",null,null,null,null,null,"x 106","Annoyance Free Percentage"]
["OU/s",99,98,96,94,90,null,"OU/s",99,98,96,94,90,null,"Separation distance",{"$f":"IF(ISERROR(MATCH($P$1,$H$32:$H$50,0)),VLOOKUP($P$1,$H$32:$M$50,MATCH(P$4,$I$31:$M$31,0)+1,TRUE)+($P$1-VLOOKUP($P$1,$H$32:$H$50,1,TRUE))*(INDEX($I$32:$M$50,MATCH($P$1,$H$32:$H$50,1)+1,MATCH(P$4,$I$31:$M$31,0))-INDEX($I$32:$M$50,MATCH($P$1,$H$32:$H$50,1),MATCH(P$4,$I$31:$M$31,0)))/(INDEX($H$32:$H$50,MATCH($P$1,$H$32:$H$50,1)+1)-INDEX($H$32:$H$50,MATCH($P$1,$H$32:$H$50,1))),INDEX($I$32:$M$50,MATCH($P$1,$H$32:$H$50,0),MATCH(P4,$I$31:$M$31,0)))","v":{"$error":"#N/A"}},{"$f":"IF(ISERROR(MATCH($P$1,$H$32:$H$50,0)),VLOOKUP($P$1,$H$32:$M$50,MATCH(Q$4,$I$31:$M$31,0)+1,TRUE)+($P$1-VLOOKUP($P$1,$H$32:$H$50,1,TRUE))*(INDEX($I$32:$M$50,MATCH($P$1,$H$32:$H$50,1)+1,MATCH(Q$4,$I$31:$M$31,0))-INDEX($I$32:$M$50,MATCH($P$1,$H$32:$H$50,1),MATCH(Q$4,$I$31:$M$31,0)))/(INDEX($H$32:$H$50,MATCH($P$1,$H$32:$H$50,1)+1)-INDEX($H$32:$H$50,MATCH($P$1,$H$32:$H$50,1))),INDEX($I$32:$M$50,MATCH($P$1,$H$32:$H$50,0),MATCH(Q4,$I$31:$M$31,0)))","v":{"$error":"#N/A"}},{"$f":"IF(ISERROR(MATCH($P$1,$H$32:$H$50,0)),VLOOKUP($P$1,$H$32:$M$50,MATCH(R$4,$I$31:$M$31,0)+1,TRUE)+($P$1-VLOOKUP($P$1,$H$32:$H$50,1,TRUE))*(INDEX($I$32:$M$50,MATCH($P$1,$H$32:$H$50,1)+1,MATCH(R$4,$I$31:$M$31,0))-INDEX($I$32:$M$50,MATCH($P$1,$H$32:$H$50,1),MATCH(R$4,$I$31:$M$31,0)))/(INDEX($H$32:$H$50,MATCH($P$1,$H$32:$H$50,1)+1)-INDEX($H$32:$H$50,MATCH($P$1,$H$32:$H$50,1))),INDEX($I$32:$M$50,MATCH($P$1,$H$32:$H$50,0),MATCH(R4,$I$31:$M$31,0)))","v":{"$error":"#N/A"}},{"$f":"IF(ISERROR(MATCH($P$1,$H$32:$H$50,0)),VLOOKUP($P$1,$H$32:$M$50,MATCH(S$4,$I$31:$M$31,0)+1,TRUE)+($P$1-VLOOKUP($P$1,$H$32:$H$50,1,TRUE))*(INDEX($I$32:$M$50,MATCH($P$1,$H$32:$H$50,1)+1,MATCH(S$4,$I$31:$M$31,0))-INDEX($I$32:$M$50,MATCH($P$1,$H$32:$H$50,1),MATCH(S$4,$I$31:$M$31,0)))/(INDEX($H$32:$H$50,MATCH($P$1,$H$32:$H$50,1)+1)-INDEX($H$32:$H$50,MATCH($P$1,$H$32:$H$50,1))),INDEX($I$32:$M$50,MATCH($P$1,$H$32:$H$50,0),MATCH(S4,$I$31:$M$31,0)))","v":{"$error":"#N/A"}},{"$f":"IF(ISERROR(MATCH($P$1,$H$32:$H$50,0)),VLOOKUP($P$1,$H$32:$M$50,MATCH(T$4,$I$31:$M$31,0)+1,TRUE)+($P$1-VLOOKUP($P$1,$H$32:$H$50,1,TRUE))*(INDEX($I$32:$M$50,MATCH($P$1,$H$32:$H$50,1)+1,MATCH(T$4,$I$31:$M$31,0))-INDEX($I$32:$M$50,MATCH($P$1,$H$32:$H$50,1),MATCH(T$4,$I$31:$M$31,0)))/(INDEX($H$32:$H$50,MATCH($P$1,$H$32:$H$50,1)+1)-INDEX($H$32:$H$50,MATCH($P$1,$H$32:$H$50,1))),INDEX($I$32:$M$50,MATCH($P$1,$H$32:$H$50,0),MATCH(T4,$I$31:$M$31,0)))","v":{"$error":"#N/A"}}]
[0,0,0,0,0,0,null,{"$f":"A32/100","v":0},0,0,0,0,0,null,"New Separation distance",{"$f":"IF(ISERROR(MATCH($P$2,$H$32:$H$50,0)),VLOOKUP($P$2,$H$32:$M$50,MATCH(P$4,$I$31:$M$31,0)+1,TRUE)+($P$2-VLOOKUP($P$2,$H$32:$H$50,1,TRUE))*(INDEX($I$32:$M$50,MATCH($P$2,$H$32:$H$50,1)+1,MATCH(P$4,$I$31:$M$31,0))-INDEX($I$32:$M$50,MATCH($P$2,$H$32:$H$50,1),MATCH(P$4,$I$31:$M$31,0)))/(INDEX($H$32:$H$50,MATCH($P$2,$H$32:$H$50,1)+1)-INDEX($H$32:$H$50,MATCH($P$2,$H$32:$H$50,1))),INDEX($I$32:$M$50,MATCH($P$2,$H$32:$H$50,0),MATCH(P4,$I$31:$M$31,0)))","v":{"$error":"#N/A"}},{"$f":"IF(ISERROR(MATCH($P$2,$H$32:$H$50,0)),VLOOKUP($P$2,$H$32:$M$50,MATCH(Q$4,$I$31:$M$31,0)+1,TRUE)+($P$2-VLOOKUP($P$2,$H$32:$H$50,1,TRUE))*(INDEX($I$32:$M$50,MATCH($P$2,$H$32:$H$50,1)+1,MATCH(Q$4,$I$31:$M$31,0))-INDEX($I$32:$M$50,MATCH($P$2,$H$32:$H$50,1),MATCH(Q$4,$I$31:$M$31,0)))/(INDEX($H$32:$H$50,MATCH($P$2,$H$32:$H$50,1)+1)-INDEX($H$32:$H$50,MATCH($P$2,$H$32:$H$50,1))),INDEX($I$32:$M$50,MATCH($P$2,$H$32:$H$50,0),MATCH(Q4,$I$31:$M$31,0)))","v":{"$error":"#N/A"}},{"$f":"IF(ISERROR(MATCH($P$2,$H$32:$H$50,0)),VLOOKUP($P$2,$H$32:$M$50,MATCH(R$4,$I$31:$M$31,0)+1,TRUE)+($P$2-VLOOKUP($P$2,$H$32:$H$50,1,TRUE))*(INDEX($I$32:$M$50,MATCH($P$2,$H$32:$H$50,1)+1,MATCH(R$4,$I$31:$M$31,0))-INDEX($I$32:$M$50,MATCH($P$2,$H$32:$H$50,1),MATCH(R$4,$I$31:$M$31,0)))/(INDEX($H$32:$H$50,MATCH($P$2,$H$32:$H$50,1)+1)-INDEX($H$32:$H$50,MATCH($P$2,$H$32:$H$50,1))),INDEX($I$32:$M$50,MATCH($P$2,$H$32:$H$50,0),MATCH(R4,$I$31:$M$31,0)))","v":{"$error":"#N/A"}},{"$f":"IF(ISERROR(MATCH($P$2,$H$32:$H$50,0)),VLOOKUP($P$2,$H$32:$M$50,MATCH(S$4,$I$31:$M$31,0)+1,TRUE)+($P$2-VLOOKUP($P$2,$H$32:$H$50,1,TRUE))*(INDEX($I$32:$M$50,MATCH($P$2,$H$32:$H$50,1)+1,MATCH(S$4,$I$31:$M$31,0))-INDEX($I$32:$M$50,MATCH($P$2,$H$32:$H$50,1),MATCH(S$4,$I$31:$M$31,0)))/(INDEX($H$32:$H$50,MATCH($P$2,$H$32:$H$50,1)+1)-INDEX($H$32:$H$50,MATCH($P$2,$H$32:$H$50,1))),INDEX($I$32:$M$50,MATCH($P$2,$H$32:$H$50,0),MATCH(S4,$I$31:$M$31,0)))","v":{"$error":"#N/A"}},{"$f":"IF(ISERROR(MATCH($P$2,$H$32:$H$50,0)),VLOOKUP($P$2,$H$32:$M$50,MATCH(T$4,$I$31:$M$31,0)+1,TRUE)+($P$2-VLOOKUP($P$2,$H$32:$H$50,1,TRUE))*(INDEX($I$32:$M$50,MATCH($P$2,$H$32:$H$50,1)+1,MATCH(T$4,$I$31:$M$31,0))-INDEX($I$32:$M$50,MATCH($P$2,$H$32:$H$50,1),MATCH(T$4,$I$31:$M$31,0)))/(INDEX($H$32:$H$50,MATCH($P$2,$H$32:$H$50,1)+1)-INDEX($H$32:$H$50,MATCH($P$2,$H$32:$H$50,1))),INDEX($I$32:$M$50,MATCH($P$2,$H$32:$H$50,0),MATCH(T4,$I$31:$M$31,0)))","v":{"$error":"#N/A"}}]
[20,206.1,135.80000000000001,93.8,78.099999999999994,56.9,null,{"$f":"A33/100","v":0.2},{"$f":"+B33/1609.347","v":0.12806436399359492},{"$f":"+C33/1609.347","v":8.438205060810379E-2},{"$f":"+D33/1609.347","v":5.8284509182917048E-2},{"$f":"+E33/1609.347","v":4.8528999650168665E-2},{"$f":"+F33/1609.347","v":3.5355954930788698E-2}]
[50,350.7,223.2,150.30000000000001,124.5,86.5,null,0.5,{"$f":"+B34/1609.347","v":0.21791447090030924},{"$f":"+C34/1609.347","v":0.1386897915738495},{"$f":"+D34/1609.347","v":9.3391916100132547E-2},{"$f":"+E34/1609.347","v":7.7360569224660683E-2},{"$f":"+F34/1609.347","v":5.3748507935206018E-2}]
[100,519.4,325.60000000000002,214.3,174.6,119.1,null,1,0.32273959562480931,0.20231808304859053,0.13315959827184567,0.10849120792470486,7.4005171041422388E-2]
[200,768.2,468.7,304.60000000000002,243.7,158.19999999999999,null,2,0.47733646006734409,0.29123613490440531,0.18926931233599717,0.15142787726947637,9.8300739368203369E-2]
[300,981.5,584.4,376,290.39999999999998,179.2,null,3,0.60987468830525671,0.36312864783045545,0.23363513275881459,0.18044585785414829,0.11134951008079674]
[400,1149.3,681,435.8,332.6,202.2,null,4,0.7141405799992171,0.42315299310838494,0.27079306078800908,0.20666767328612165,0.12564102086125614]
[500,1316.2,757.2,477.3,372.9,205.8,null,5,0.81784723866263775,0.47050138969408095,0.29657991719622928,0.23170888565362224,0.12787795298341503]
[600,1447.1,839.2,531.6,402.2,219,null,6,0.89918457610446967,0.52145373247658833,0.33032031003879214,0.24991502764785967,0.13608003743133085]
[700,1581.8,908.1,571.4,425,240.3,null,7,0.98288311967524711,0.5642661278145733,0.35505083738932625,0.26408226442153249,0.14931521915410412]
[800,1702.6,961.2,598.29999999999995,455.7,255.4,null,8,1.0579446197743556,0.59726087661641647,0.37176569130212439,0.2831583244632761,0.15869790666649269]
[900,1817.8,1020.9,643.9,477.5,267.89999999999998,null,9,1.1295264476834392,0.63435666764221765,0.40010016484946997,0.29670419120301589,0.16646503209065538]
[1000,1946,1081,670.7,509.8,252.4,null,10,1.2091860860336521,0.67170100668159194,0.41675288175887493,0.31677444329905236,0.15683379656469362]
[1500,2403.9,1320,810.7,605.1,292.10000000000002,null,15,1.493711424571581,0.82020844479158317,0.50374468650949733,0.37599100753286896,0.18150218691183445]
[2000,2797.5,1532.2,948.1,674.6,318.89999999999998,null,20,1.7382826699276166,0.95206316599216956,0.58912092917189396,0.41917622489121364,0.19815490382123929]
[2500,3142.2,1730,1050,753.8,351.6,null,25,1.9524689206243278,1.0749701587041203,0.65243853562966847,0.46838873157870858,0.218473703930849]
[3000,3499.2,1910,1152.9000000000001,787.2,360,null,30,2.174298022738415,1.1868167648120636,0.71637751212137601,0.48914249071207144,0.22369321221588631]
[3500,3880,2032.1,1204.2,815,370,null,35,2.4109157316601082,1.2626860459552849,0.74825379486213972,0.50641657765540926,0.2299069125552165]
[4000,4231.1000000000004,2182.4,1288.0999999999999,842.2,374.6,null,40,2.6290787505739908,1.3560779620554175,0.80038674070911986,0.52331784257838743,0.2327652147113084]
[]
[]
["Alliance, NE - AERMOD setback distances (S) as reported in the Odor Footprint Tool"]
[]
["Setback Distances (m) S Direction",null,null,null,null,null,null,"Setback Distances (mi)  S Direction"]
["x 104","Annoyance Free Percentage",null,null,null,null,null,"x 106","Annoyance Free Percentage"]
["OU/s",99,98,96,94,90,null,"OU/s",99,98,96,94,90,null,"Separation distance",{"$f":"IF(ISERROR(MATCH($P$1,$H$58:$H$76,0)),VLOOKUP($P$1,$H$58:$M$76,MATCH(P$4,$I$57:$M$57,0)+1,TRUE)+($P$1-VLOOKUP($P$1,$H$58:$H$76,1,TRUE))*(INDEX($I$58:$M$76,MATCH($P$1,$H$58:$H$76,1)+1,MATCH(P$4,$I$57:$M$57,0))-INDEX($I$58:$M$76,MATCH($P$1,$H$58:$H$76,1),MATCH(P$4,$I$57:$M$57,0)))/(INDEX($H$58:$H$76,MATCH($P$1,$H$58:$H$76,1)+1)-INDEX($H$58:$H$76,MATCH($P$1,$H$58:$H$76,1))),INDEX($I$58:$M$76,MATCH($P$1,$H$58:$H$76,0),MATCH(P$4,$I$57:$M$57,0)))","v":{"$error":"#N/A"}},{"$f":"IF(ISERROR(MATCH($P$1,$H$58:$H$76,0)),VLOOKUP($P$1,$H$58:$M$76,MATCH(Q$4,$I$57:$M$57,0)+1,TRUE)+($P$1-VLOOKUP($P$1,$H$58:$H$76,1,TRUE))*(INDEX($I$58:$M$76,MATCH($P$1,$H$58:$H$76,1)+1,MATCH(Q$4,$I$57:$M$57,0))-INDEX($I$58:$M$76,MATCH($P$1,$H$58:$H$76,1),MATCH(Q$4,$I$57:$M$57,0)))/(INDEX($H$58:$H$76,MATCH($P$1,$H$58:$H$76,1)+1)-INDEX($H$58:$H$76,MATCH($P$1,$H$58:$H$76,1))),INDEX($I$58:$M$76,MATCH($P$1,$H$58:$H$76,0),MATCH(Q$4,$I$57:$M$57,0)))","v":{"$error":"#N/A"}},{"$f":"IF(ISERROR(MATCH($P$1,$H$58:$H$76,0)),VLOOKUP($P$1,$H$58:$M$76,MATCH(R$4,$I$57:$M$57,0)+1,TRUE)+($P$1-VLOOKUP($P$1,$H$58:$H$76,1,TRUE))*(INDEX($I$58:$M$76,MATCH($P$1,$H$58:$H$76,1)+1,MATCH(R$4,$I$57:$M$57,0))-INDEX($I$58:$M$76,MATCH($P$1,$H$58:$H$76,1),MATCH(R$4,$I$57:$M$57,0)))/(INDEX($H$58:$H$76,MATCH($P$1,$H$58:$H$76,1)+1)-INDEX($H$58:$H$76,MATCH($P$1,$H$58:$H$76,1))),INDEX($I$58:$M$76,MATCH($P$1,$H$58:$H$76,0),MATCH(R$4,$I$57:$M$57,0)))","v":{"$error":"#N/A"}},{"$f":"IF(ISERROR(MATCH($P$1,$H$58:$H$76,0)),VLOOKUP($P$1,$H$58:$M$76,MATCH(S$4,$I$57:$M$57,0)+1,TRUE)+($P$1-VLOOKUP($P$1,$H$58:$H$76,1,TRUE))*(INDEX($I$58:$M$76,MATCH($P$1,$H$58:$H$76,1)+1,MATCH(S$4,$I$57:$M$57,0))-INDEX($I$58:$M$76,MATCH($P$1,$H$58:$H$76,1),MATCH(S$4,$I$57:$M$57,0)))/(INDEX($H$58:$H$76,MATCH($P$1,$H$58:$H$76,1)+1)-INDEX($H$58:$H$76,MATCH($P$1,$H$58:$H$76,1))),INDEX($I$58:$M$76,MATCH($P$1,$H$58:$H$76,0),MATCH(S$4,$I$57:$M$57,0)))","v":{"$error":"#N/A"}},{"$f":"IF(ISERROR(MATCH($P$1,$H$58:$H$76,0)),VLOOKUP($P$1,$H$58:$M$76,MATCH(T$4,$I$57:$M$57,0)+1,TRUE)+($P$1-VLOOKUP($P$1,$H$58:$H$76,1,TRUE))*(INDEX($I$58:$M$76,MATCH($P$1,$H$58:$H$76,1)+1,MATCH(T$4,$I$57:$M$57,0))-INDEX($I$58:$M$76,MATCH($P$1,$H$58:$H$76,1),MATCH(T$4,$I$57:$M$57,0)))/(INDEX($H$58:$H$76,MATCH($P$1,$H$58:$H$76,1)+1)-INDEX($H$58:$H$76,MATCH($P$1,$H$58:$H$76,1))),INDEX($I$58:$M$76,MATCH($P$1,$H$58:$H$76,0),MATCH(T$4,$I$57:$M$57,0)))","v":{"$error":"#N/A"}}]
[0,0,0,0,0,0,null,{"$f":"A58/100","v":0},0,0,0,0,0,null,"New Separation distance",{"$f":"IF(ISERROR(MATCH($P$2,$H$58:$H$76,0)),VLOOKUP($P$2,$H$58:$M$76,MATCH(P$4,$I$57:$M$57,0)+1,TRUE)+($P$2-VLOOKUP($P$2,$H$58:$H$76,1,TRUE))*(INDEX($I$58:$M$76,MATCH($P$2,$H$58:$H$76,1)+1,MATCH(P$4,$I$57:$M$57,0))-INDEX($I$58:$M$76,MATCH($P$2,$H$58:$H$76,1),MATCH(P$4,$I$57:$M$57,0)))/(INDEX($H$58:$H$76,MATCH($P$2,$H$58:$H$76,1)+1)-INDEX($H$58:$H$76,MATCH($P$2,$H$58:$H$76,1))),INDEX($I$58:$M$76,MATCH($P$2,$H$58:$H$76,0),MATCH(P4,$I$57:$M$57,0)))","v":{"$error":"#N/A"}},{"$f":"IF(ISERROR(MATCH($P$2,$H$58:$H$76,0)),VLOOKUP($P$2,$H$58:$M$76,MATCH(Q$4,$I$57:$M$57,0)+1,TRUE)+($P$2-VLOOKUP($P$2,$H$58:$H$76,1,TRUE))*(INDEX($I$58:$M$76,MATCH($P$2,$H$58:$H$76,1)+1,MATCH(Q$4,$I$57:$M$57,0))-INDEX($I$58:$M$76,MATCH($P$2,$H$58:$H$76,1),MATCH(Q$4,$I$57:$M$57,0)))/(INDEX($H$58:$H$76,MATCH($P$2,$H$58:$H$76,1)+1)-INDEX($H$58:$H$76,MATCH($P$2,$H$58:$H$76,1))),INDEX($I$58:$M$76,MATCH($P$2,$H$58:$H$76,0),MATCH(Q4,$I$57:$M$57,0)))","v":{"$error":"#N/A"}},{"$f":"IF(ISERROR(MATCH($P$2,$H$58:$H$76,0)),VLOOKUP($P$2,$H$58:$M$76,MATCH(R$4,$I$57:$M$57,0)+1,TRUE)+($P$2-VLOOKUP($P$2,$H$58:$H$76,1,TRUE))*(INDEX($I$58:$M$76,MATCH($P$2,$H$58:$H$76,1)+1,MATCH(R$4,$I$57:$M$57,0))-INDEX($I$58:$M$76,MATCH($P$2,$H$58:$H$76,1),MATCH(R$4,$I$57:$M$57,0)))/(INDEX($H$58:$H$76,MATCH($P$2,$H$58:$H$76,1)+1)-INDEX($H$58:$H$76,MATCH($P$2,$H$58:$H$76,1))),INDEX($I$58:$M$76,MATCH($P$2,$H$58:$H$76,0),MATCH(R4,$I$57:$M$57,0)))","v":{"$error":"#N/A"}},{"$f":"IF(ISERROR(MATCH($P$2,$H$58:$H$76,0)),VLOOKUP($P$2,$H$58:$M$76,MATCH(S$4,$I$57:$M$57,0)+1,TRUE)+($P$2-VLOOKUP($P$2,$H$58:$H$76,1,TRUE))*(INDEX($I$58:$M$76,MATCH($P$2,$H$58:$H$76,1)+1,MATCH(S$4,$I$57:$M$57,0))-INDEX($I$58:$M$76,MATCH($P$2,$H$58:$H$76,1),MATCH(S$4,$I$57:$M$57,0)))/(INDEX($H$58:$H$76,MATCH($P$2,$H$58:$H$76,1)+1)-INDEX($H$58:$H$76,MATCH($P$2,$H$58:$H$76,1))),INDEX($I$58:$M$76,MATCH($P$2,$H$58:$H$76,0),MATCH(S4,$I$57:$M$57,0)))","v":{"$error":"#N/A"}},{"$f":"IF(ISERROR(MATCH($P$2,$H$58:$H$76,0)),VLOOKUP($P$2,$H$58:$M$76,MATCH(T$4,$I$57:$M$57,0)+1,TRUE)+($P$2-VLOOKUP($P$2,$H$58:$H$76,1,TRUE))*(INDEX($I$58:$M$76,MATCH($P$2,$H$58:$H$76,1)+1,MATCH(T$4,$I$57:$M$57,0))-INDEX($I$58:$M$76,MATCH($P$2,$H$58:$H$76,1),MATCH(T$4,$I$57:$M$57,0)))/(INDEX($H$58:$H$76,MATCH($P$2,$H$58:$H$76,1)+1)-INDEX($H$58:$H$76,MATCH($P$2,$H$58:$H$76,1))),INDEX($I$58:$M$76,MATCH($P$2,$H$58:$H$76,0),MATCH(T4,$I$57:$M$57,0)))","v":{"$error":"#N/A"}}]
[20,211.6,142.80000000000001,95.9,79.099999999999994,59.8,null,{"$f":"A59/100","v":0.2},{"$f":"+B59/1609.347","v":0.13148189918022651},{"$f":"+C59/1609.347","v":8.873164084563491E-2},{"$f":"+D59/1609.347","v":5.9589386254176389E-2},{"$f":"+E59/1609.347","v":4.9150369684101684E-2},{"$f":"+F59/1609.347","v":3.7157928029194445E-2}]
[50,357.9,234.2,154.6,126.7,92.7,null,0.5,{"$f":"+B60/1609.347","v":0.22238833514462697},{"$f":"+C60/1609.347","v":0.1455248619471127},{"$f":"+D60/1609.347","v":9.6063807246044505E-2},{"$f":"+E60/1609.347","v":7.8727583299313328E-2},{"$f":"+F60/1609.347","v":5.7601002145590732E-2}]
[100,532.4,339,221.4,180.2,126.1,null,1,0.33081740606593851,0.21064444150329295,0.1375713255127701,0.11197088011472976,7.8354761278953508E-2]
[200,786.6,487.3,316,253.1,169.8,null,2,0.48876966869171162,0.30279361753555945,0.19635293072283355,0.15726875558844675,0.10550863176182639]
[300,987.7,601.20000000000005,387.6,307.8,199.8,null,3,0.61372718251564151,0.37356766440053019,0.24084302515243763,0.19125769644458282,0.12414973277981692]
[400,1169.8,696.8,448.2,353.8,222.7,null,4,0.72687866569484394,0.43297063964452659,0.27849804920877846,0.21984071800550162,0.13837910655688301]
[500,1326.8,781.3,500.3,393.3,240.4,null,5,0.82443376102232768,0.4854764075118666,0.31087142797668871,0.24438483434585581,0.14937735615749742]
[600,1465.6,858,547.9,427.6,256.39999999999998,null,6,0.91067992173223045,0.53313548911452902,0.3404486415919003,0.26569782650975832,0.1593192767004257]
[700,1585.1,927.7,590.20000000000005,462.1,275.3,null,7,0.98493364078722612,0.57644498047966042,0.36673259402726699,0.2871350926804474,0.17106317034175975]
[800,1711.5,990.7,633,488.7,287,null,8,1.0634748130763596,0.6155912926174405,0.39332723147960014,0.30366353558306569,0.17833319973877604]
[900,1840,1062.7,670,516.70000000000005,296.5,null,9,1.1433208624367523,0.66032993506061777,0.41631792273512175,0.32106189653319023,0.18423621506113971]
[1000,1953,1117.2,708,536.6,309.89999999999998,null,10,1.2135356762711833,0.69419460190996729,0.43992998402457645,0.33342716020845725,0.19256257351584213]
[1500,2434.6,1378.1,857,650,357.9,null,15,1.5127874846133245,0.85631004376309139,0.53251411908059609,0.40389052205646142,0.22238833514462697]
[2000,2889.3,1609.1,987.8,735.6,390.6,null,20,1.7953244390426677,0.99984652160161847,0.6137893195190347,0.45707979696112772,0.24270713525423668]
[2500,3219.7,1788.2,1095.0999999999999,810.7,409.4,null,25,2.0006250982541367,1.1111338946790221,0.68046232416004748,0.50374468650949733,0.25438889189217739]
[3000,3566,1960.4,1194.3,865.4,440.9,null,30,2.2158055410051407,1.2181338145222878,0.7421022315262028,0.53773362736563335,0.27396204796106743]
[3500,3907.4,2117.6999999999998,1294,920,464.5,null,35,2.4279412705898729,1.3158753208599512,0.80405282390932475,0.57166043121837617,0.28862638076188668]
[4000,4190,2273.5,1378.2,979.8,484.8,null,40,2.6035404421793436,1.4126847721467155,0.8563721807664848,0.60881835924757055,0.30124019245072692]
[]
[]
["Alliance, NE - AERMOD setback distances (W) as reported in the Odor Footprint Tool"]
[]
["Setback Distances (m) W Direction",null,null,null,null,null,null,"Setback Distances (mi) W Direction"]
["x 104","Annoyance Free Percentage",null,null,null,null,null,"x 106","Annoyance Free Percentage"]
["OU/s",99,98,96,94,90,null,"OU/s",99,98,96,94,90,null,"Separation distance",{"$f":"IF(ISERROR(MATCH($P$1,$H$84:$H$102,0)),VLOOKUP($P$1,$H$84:$M$102,MATCH(P$4,$I$83:$M$83,0)+1,TRUE)+($P$1-VLOOKUP($P$1,$H$84:$H$102,1,TRUE))*(INDEX($I$84:$M$102,MATCH($P$1,$H$84:$H$102,1)+1,MATCH(P$4,$I$83:$M$83,0))-INDEX($I$84:$M$102,MATCH($P$1,$H$84:$H$102,1),MATCH(P$4,$I$83:$M$83,0)))/(INDEX($H$84:$H$102,MATCH($P$1,$H$84:$H$102,1)+1)-INDEX($H$84:$H$102,MATCH($P$1,$H$84:$H$102,1))),INDEX($I$84:$M$102,MATCH($P$1,$H$84:$H$102,0),MATCH(P4,$I$83:$M$83,0)))","v":{"$error":"#N/A"}},{"$f":"IF(ISERROR(MATCH($P$1,$H$84:$H$102,0)),VLOOKUP($P$1,$H$84:$M$102,MATCH(Q$4,$I$83:$M$83,0)+1,TRUE)+($P$1-VLOOKUP($P$1,$H$84:$H$102,1,TRUE))*(INDEX($I$84:$M$102,MATCH($P$1,$H$84:$H$102,1)+1,MATCH(Q$4,$I$83:$M$83,0))-INDEX($I$84:$M$102,MATCH($P$1,$H$84:$H$102,1),MATCH(Q$4,$I$83:$M$83,0)))/(INDEX($H$84:$H$102,MATCH($P$1,$H$84:$H$102,1)+1)-INDEX($H$84:$H$102,MATCH($P$1,$H$84:$H$102,1))),INDEX($I$84:$M$102,MATCH($P$1,$H$84:$H$102,0),MATCH(Q4,$I$83:$M$83,0)))","v":{"$error":"#N/A"}},{"$f":"IF(ISERROR(MATCH($P$1,$H$84:$H$102,0)),VLOOKUP($P$1,$H$84:$M$102,MATCH(R$4,$I$83:$M$83,0)+1,TRUE)+($P$1-VLOOKUP($P$1,$H$84:$H$102,1,TRUE))*(INDEX($I$84:$M$102,MATCH($P$1,$H$84:$H$102,1)+1,MATCH(R$4,$I$83:$M$83,0))-INDEX($I$84:$M$102,MATCH($P$1,$H$84:$H$102,1),MATCH(R$4,$I$83:$M$83,0)))/(INDEX($H$84:$H$102,MATCH($P$1,$H$84:$H$102,1)+1)-INDEX($H$84:$H$102,MATCH($P$1,$H$84:$H$102,1))),INDEX($I$84:$M$102,MATCH($P$1,$H$84:$H$102,0),MATCH(R4,$I$83:$M$83,0)))","v":{"$error":"#N/A"}},{"$f":"IF(ISERROR(MATCH($P$1,$H$84:$H$102,0)),VLOOKUP($P$1,$H$84:$M$102,MATCH(S$4,$I$83:$M$83,0)+1,TRUE)+($P$1-VLOOKUP($P$1,$H$84:$H$102,1,TRUE))*(INDEX($I$84:$M$102,MATCH($P$1,$H$84:$H$102,1)+1,MATCH(S$4,$I$83:$M$83,0))-INDEX($I$84:$M$102,MATCH($P$1,$H$84:$H$102,1),MATCH(S$4,$I$83:$M$83,0)))/(INDEX($H$84:$H$102,MATCH($P$1,$H$84:$H$102,1)+1)-INDEX($H$84:$H$102,MATCH($P$1,$H$84:$H$102,1))),INDEX($I$84:$M$102,MATCH($P$1,$H$84:$H$102,0),MATCH(S4,$I$83:$M$83,0)))","v":{"$error":"#N/A"}},{"$f":"IF(ISERROR(MATCH($P$1,$H$84:$H$102,0)),VLOOKUP($P$1,$H$84:$M$102,MATCH(T$4,$I$83:$M$83,0)+1,TRUE)+($P$1-VLOOKUP($P$1,$H$84:$H$102,1,TRUE))*(INDEX($I$84:$M$102,MATCH($P$1,$H$84:$H$102,1)+1,MATCH(T$4,$I$83:$M$83,0))-INDEX($I$84:$M$102,MATCH($P$1,$H$84:$H$102,1),MATCH(T$4,$I$83:$M$83,0)))/(INDEX($H$84:$H$102,MATCH($P$1,$H$84:$H$102,1)+1)-INDEX($H$84:$H$102,MATCH($P$1,$H$84:$H$102,1))),INDEX($I$84:$M$102,MATCH($P$1,$H$84:$H$102,0),MATCH(T4,$I$83:$M$83,0)))","v":{"$error":"#N/A"}}]
[0,0,0,0,0,0,null,{"$f":"A84/100","v":0},0,0,0,0,0,null,"New Separation distance",{"$f":"IF(ISERROR(MATCH($P$2,$H$84:$H$102,0)),VLOOKUP($P$2,$H$84:$M$102,MATCH(P$4,$I$83:$M$83,0)+1,TRUE)+($P$2-VLOOKUP($P$2,$H$84:$H$102,1,TRUE))*(INDEX($I$84:$M$102,MATCH($P$2,$H$84:$H$102,1)+1,MATCH(P$4,$I$83:$M$83,0))-INDEX($I$84:$M$102,MATCH($P$2,$H$84:$H$102,1),MATCH(P$4,$I$83:$M$83,0)))/(INDEX($H$84:$H$102,MATCH($P$2,$H$84:$H$102,1)+1)-INDEX($H$84:$H$102,MATCH($P$2,$H$84:$H$102,1))),INDEX($I$84:$M$102,MATCH($P$2,$H$84:$H$102,0),MATCH(P4,$I$83:$M$83,0)))","v":{"$error":"#N/A"}},{"$f":"IF(ISERROR(MATCH($P$2,$H$84:$H$102,0)),VLOOKUP($P$2,$H$84:$M$102,MATCH(Q$4,$I$83:$M$83,0)+1,TRUE)+($P$2-VLOOKUP($P$2,$H$84:$H$102,1,TRUE))*(INDEX($I$84:$M$102,MATCH($P$2,$H$84:$H$102,1)+1,MATCH(Q$4,$I$83:$M$83,0))-INDEX($I$84:$M$102,MATCH($P$2,$H$84:$H$102,1),MATCH(Q$4,$I$83:$M$83,0)))/(INDEX($H$84:$H$102,MATCH($P$2,$H$84:$H$102,1)+1)-INDEX($H$84:$H$102,MATCH($P$2,$H$84:$H$102,1))),INDEX($I$84:$M$102,MATCH($P$2,$H$84:$H$102,0),MATCH(Q4,$I$83:$M$83,0)))","v":{"$error":"#N/A"}},{"$f":"IF(ISERROR(MATCH($P$2,$H$84:$H$102,0)),VLOOKUP($P$2,$H$84:$M$102,MATCH(R$4,$I$83:$M$83,0)+1,TRUE)+($P$2-VLOOKUP($P$2,$H$84:$H$102,1,TRUE))*(INDEX($I$84:$M$102,MATCH($P$2,$H$84:$H$102,1)+1,MATCH(R$4,$I$83:$M$83,0))-INDEX($I$84:$M$102,MATCH($P$2,$H$84:$H$102,1),MATCH(R$4,$I$83:$M$83,0)))/(INDEX($H$84:$H$102,MATCH($P$2,$H$84:$H$102,1)+1)-INDEX($H$84:$H$102,MATCH($P$2,$H$84:$H$102,1))),INDEX($I$84:$M$102,MATCH($P$2,$H$84:$H$102,0),MATCH(R4,$I$83:$M$83,0)))","v":{"$error":"#N/A"}},{"$f":"IF(ISERROR(MATCH($P$2,$H$84:$H$102,0)),VLOOKUP($P$2,$H$84:$M$102,MATCH(S$4,$I$83:$M$83,0)+1,TRUE)+($P$2-VLOOKUP($P$2,$H$84:$H$102,1,TRUE))*(INDEX($I$84:$M$102,MATCH($P$2,$H$84:$H$102,1)+1,MATCH(S$4,$I$83:$M$83,0))-INDEX($I$84:$M$102,MATCH($P$2,$H$84:$H$102,1),MATCH(S$4,$I$83:$M$83,0)))/(INDEX($H$84:$H$102,MATCH($P$2,$H$84:$H$102,1)+1)-INDEX($H$84:$H$102,MATCH($P$2,$H$84:$H$102,1))),INDEX($I$84:$M$102,MATCH($P$2,$H$84:$H$102,0),MATCH(S4,$I$83:$M$83,0)))","v":{"$error":"#N/A"}},{"$f":"IF(ISERROR(MATCH($P$2,$H$84:$H$102,0)),VLOOKUP($P$2,$H$84:$M$102,MATCH(T$4,$I$83:$M$83,0)+1,TRUE)+($P$2-VLOOKUP($P$2,$H$84:$H$102,1,TRUE))*(INDEX($I$84:$M$102,MATCH($P$2,$H$84:$H$102,1)+1,MATCH(T$4,$I$83:$M$83,0))-INDEX($I$84:$M$102,MATCH($P$2,$H$84:$H$102,1),MATCH(T$4,$I$83:$M$83,0)))/(INDEX($H$84:$H$102,MATCH($P$2,$H$84:$H$102,1)+1)-INDEX($H$84:$H$102,MATCH($P$2,$H$84:$H$102,1))),INDEX($I$84:$M$102,MATCH($P$2,$H$84:$H$102,0),MATCH(T4,$I$83:$M$83,0)))","v":{"$error":"#N/A"}}]
[20,186.8,130.1,94,78.900000000000006,59.1,null,{"$f":"A85/100","v":0.2},{"$f":"+B85/1609.347","v":0.11607192233868768},{"$f":"+C85/1609.347","v":8.0840241414685585E-2},{"$f":"+D85/1609.347","v":5.8408783189703647E-2},{"$f":"+E85/1609.347","v":4.9026095677315092E-2},{"$f":"+F85/1609.347","v":3.6722969005441336E-2}]
[50,320.7,217.5,151.69999999999999,126.3,92.7,null,0.5,{"$f":"+B86/1609.347","v":0.19927336988231872},{"$f":"+C86/1609.347","v":0.13514798238043133},{"$f":"+D86/1609.347","v":9.4261834147638751E-2},{"$f":"+E86/1609.347","v":7.8479035285740115E-2},{"$f":"+F86/1609.347","v":5.7601002145590732E-2}]
[100,478.7,324.8,221.5,175.7,123.3,null,1,0.29744983524373547,0.2018209870214441,0.1376334625161634,0.10917471496203118,7.6614925183941057E-2]
[200,720,463.8,314.3,254.7,171.3,null,2,0.44738642443177262,0.28819142173813356,0.19529660166514742,0.15826294764273957,0.10644068681272592]
[300,903.4,587.4,381.8,307,191.5,null,3,0.56134568865508805,0.3649927579322545,0.2372390789556261,0.19076060041743639,0.11899236149817287]
[400,1081.8,678.1,444.2,356.5,209.3,null,4,0.67219810270873837,0.4213510200099792,0.27601256907304639,0.22151841709712075,0.13005274810218059]
[500,1230.4000000000001,771.9,501.1,376.4,234,null,5,0.76453368975118485,0.47963552919289626,0.31136852400383513,0.2338836807723878,0.14540058794032612]
[600,1361.6,838.6,541.20000000000005,410.8,249.5,null,6,0.84605743820319668,0.52108091045622851,0.33628546236454915,0.25525880993968364,0.15503182346628788]
[700,1486.6,915.6,581.4,457.4,245.2,null,7,0.92372869244482381,0.56892640306907094,0.36126453772865641,0.2842146535209622,0.1523599323203759]
[800,1598.5,965.9,629.1,471.2,265,null,8,0.99325999924192854,0.60018131577590161,0.39090388834726136,0.29278955998923789,0.16466305899224964]
[900,1715.3,1049.9000000000001,663.8,480.5,288.7,null,9,1.0658360192053049,0.65237639862627517,0.41246542852473705,0.29856830130481493,0.17938952879646217]
[1000,1824.8,1087.0999999999999,709.5,513.70000000000005,304.60000000000002,null,10,1.1338760379209705,0.67549136388858333,0.44086203907547594,0.31919778643139113,0.18926931233599717]
[1500,2306.9,1363.3,858.4,622.29999999999995,348.1,null,15,1.4334385312800784,0.84711376726088283,0.53338403712810223,0.38667857211651679,0.21629890881208344]
[2000,2718.4,1587.7,963.5,694.2,390.7,null,20,1.689132300243515,0.986549202875452,0.59869002769446245,0.43135507755630081,0.24276927225762995]
[2500,3078.6,1755.7,1091,781,430.7,null,25,1.9129497864661877,1.090939368576199,0.67791470702092216,0.48528999650168669,0.26762407361495066]
[3000,3419.6,1935.6,1173.2,810,420,null,30,2.1248369680373469,1.2027238376807488,0.72899132381021625,0.50330972748574421,0.26097541425186738]
[3500,3763.2,2124.1,1285.0999999999999,872.6,442.7,null,35,2.3383397116967317,1.3198520890771226,0.79852263060732076,0.54220749160995119,0.27508051402214689]
[4000,4061.9,2292.6,1378.2,939.3,470.1,null,40,2.5239429408325242,1.424552939794836,0.8563721807664848,0.58365287287328338,0.29210605295191155]

{"sheet":"Scottsbluff","index":11,"n_rows":93,"n_cols":20,"rows_kept":93,"cut":false,"hidden":true,"merged":[[81,1,81,5],[81,8,81,12],[3,1,3,5],[3,8,3,12],[29,1,29,5],[29,8,29,12],[55,1,55,5],[55,8,55,12]]}
["Scottsbluff, NE-AERMOD setback distances (NE) as reported in the Odor Footprint Tool",null,null,null,null,null,null,null,null,null,null,null,null,null,"Total Scaled Odor Emission Rate (x10^6)",{"$f":"Inputs!E33","v":""}]
[null,null,null,null,null,null,null,null,null,null,null,null,null,null,"New Total Scaled Odor Emission Rate (x10^6)",{"$f":"Inputs!E42","v":""}]
["Setback Distances (m) for Scottsbluff, NE Direction",null,null,null,null,null,null,"Setback Distances (mi) for Scottsbluff, NE Direction"]
["x 104","Annoyance Free Percentage",null,null,null,null,null,"x 106","Annoyance Free Percentage",null,null,null,null,null,"Annoyance free percentage",99,98,96,94,90]
["OU/s",99,98,96,94,90,null,"OU/s",99,98,96,94,90,null,"Separation distance",{"$f":"IF(ISERROR(MATCH($P$1,$H$6:$H$24,0)),VLOOKUP($P$1,$H$6:$M$24,MATCH(P4,$I$5:$M$5,0)+1,TRUE)+($P$1-VLOOKUP($P$1,$H$6:$H$24,1,TRUE))*(INDEX($I$6:$M$24,MATCH($P$1,$H$6:$H$24,1)+1,MATCH(P4,$I$5:$M$5,0))-INDEX($I$6:$M$24,MATCH($P$1,$H$6:$H$24,1),MATCH(P4,$I$5:$M$5,0)))/(INDEX($H$6:$H$24,MATCH($P$1,$H$6:$H$24,1)+1)-INDEX($H$6:$H$24,MATCH($P$1,$H$6:$H$24,1))),INDEX($I$6:$M$24,MATCH($P$1,$H$6:$H$24,0),MATCH(P4,$I$5:$M$5,0)))","v":{"$error":"#N/A"}},{"$f":"IF(ISERROR(MATCH($P$1,$H$6:$H$24,0)),VLOOKUP($P$1,$H$6:$M$24,MATCH(Q4,$I$5:$M$5,0)+1,TRUE)+($P$1-VLOOKUP($P$1,$H$6:$H$24,1,TRUE))*(INDEX($I$6:$M$24,MATCH($P$1,$H$6:$H$24,1)+1,MATCH(Q4,$I$5:$M$5,0))-INDEX($I$6:$M$24,MATCH($P$1,$H$6:$H$24,1),MATCH(Q4,$I$5:$M$5,0)))/(INDEX($H$6:$H$24,MATCH($P$1,$H$6:$H$24,1)+1)-INDEX($H$6:$H$24,MATCH($P$1,$H$6:$H$24,1))),INDEX($I$6:$M$24,MATCH($P$1,$H$6:$H$24,0),MATCH(Q4,$I$5:$M$5,0)))","v":{"$error":"#N/A"}},{"$f":"IF(ISERROR(MATCH($P$1,$H$6:$H$24,0)),VLOOKUP($P$1,$H$6:$M$24,MATCH(R4,$I$5:$M$5,0)+1,TRUE)+($P$1-VLOOKUP($P$1,$H$6:$H$24,1,TRUE))*(INDEX($I$6:$M$24,MATCH($P$1,$H$6:$H$24,1)+1,MATCH(R4,$I$5:$M$5,0))-INDEX($I$6:$M$24,MATCH($P$1,$H$6:$H$24,1),MATCH(R4,$I$5:$M$5,0)))/(INDEX($H$6:$H$24,MATCH($P$1,$H$6:$H$24,1)+1)-INDEX($H$6:$H$24,MATCH($P$1,$H$6:$H$24,1))),INDEX($I$6:$M$24,MATCH($P$1,$H$6:$H$24,0),MATCH(R4,$I$5:$M$5,0)))","v":{"$error":"#N/A"}},{"$f":"IF(ISERROR(MATCH($P$1,$H$6:$H$24,0)),VLOOKUP($P$1,$H$6:$M$24,MATCH(S4,$I$5:$M$5,0)+1,TRUE)+($P$1-VLOOKUP($P$1,$H$6:$H$24,1,TRUE))*(INDEX($I$6:$M$24,MATCH($P$1,$H$6:$H$24,1)+1,MATCH(S4,$I$5:$M$5,0))-INDEX($I$6:$M$24,MATCH($P$1,$H$6:$H$24,1),MATCH(S4,$I$5:$M$5,0)))/(INDEX($H$6:$H$24,MATCH($P$1,$H$6:$H$24,1)+1)-INDEX($H$6:$H$24,MATCH($P$1,$H$6:$H$24,1))),INDEX($I$6:$M$24,MATCH($P$1,$H$6:$H$24,0),MATCH(S4,$I$5:$M$5,0)))","v":{"$error":"#N/A"}},{"$f":"IF(ISERROR(MATCH($P$1,$H$6:$H$24,0)),VLOOKUP($P$1,$H$6:$M$24,MATCH(T4,$I$5:$M$5,0)+1,TRUE)+($P$1-VLOOKUP($P$1,$H$6:$H$24,1,TRUE))*(INDEX($I$6:$M$24,MATCH($P$1,$H$6:$H$24,1)+1,MATCH(T4,$I$5:$M$5,0))-INDEX($I$6:$M$24,MATCH($P$1,$H$6:$H$24,1),MATCH(T4,$I$5:$M$5,0)))/(INDEX($H$6:$H$24,MATCH($P$1,$H$6:$H$24,1)+1)-INDEX($H$6:$H$24,MATCH($P$1,$H$6:$H$24,1))),INDEX($I$6:$M$24,MATCH($P$1,$H$6:$H$24,0),MATCH(T4,$I$5:$M$5,0)))","v":{"$error":"#N/A"}}]
[0,0,0,0,0,0,null,{"$f":"A6/100","v":0},0,0,0,0,0,null,"New Separation distance",{"$f":"IF(ISERROR(MATCH($P$2,$H$6:$H$24,0)),VLOOKUP($P$2,$H$6:$M$24,MATCH(P4,$I$5:$M$5,0)+1,TRUE)+($P$2-VLOOKUP($P$2,$H$6:$H$24,1,TRUE))*(INDEX($I$6:$M$24,MATCH($P$2,$H$6:$H$24,1)+1,MATCH(P4,$I$5:$M$5,0))-INDEX($I$6:$M$24,MATCH($P$2,$H$6:$H$24,1),MATCH(P4,$I$5:$M$5,0)))/(INDEX($H$6:$H$24,MATCH($P$2,$H$6:$H$24,1)+1)-INDEX($H$6:$H$24,MATCH($P$2,$H$6:$H$24,1))),INDEX($I$6:$M$24,MATCH($P$2,$H$6:$H$24,0),MATCH(P4,$I$5:$M$5,0)))","v":{"$error":"#N/A"}},{"$f":"IF(ISERROR(MATCH($P$2,$H$6:$H$24,0)),VLOOKUP($P$2,$H$6:$M$24,MATCH(Q4,$I$5:$M$5,0)+1,TRUE)+($P$2-VLOOKUP($P$2,$H$6:$H$24,1,TRUE))*(INDEX($I$6:$M$24,MATCH($P$2,$H$6:$H$24,1)+1,MATCH(Q4,$I$5:$M$5,0))-INDEX($I$6:$M$24,MATCH($P$2,$H$6:$H$24,1),MATCH(Q4,$I$5:$M$5,0)))/(INDEX($H$6:$H$24,MATCH($P$2,$H$6:$H$24,1)+1)-INDEX($H$6:$H$24,MATCH($P$2,$H$6:$H$24,1))),INDEX($I$6:$M$24,MATCH($P$2,$H$6:$H$24,0),MATCH(Q4,$I$5:$M$5,0)))","v":{"$error":"#N/A"}},{"$f":"IF(ISERROR(MATCH($P$2,$H$6:$H$24,0)),VLOOKUP($P$2,$H$6:$M$24,MATCH(R4,$I$5:$M$5,0)+1,TRUE)+($P$2-VLOOKUP($P$2,$H$6:$H$24,1,TRUE))*(INDEX($I$6:$M$24,MATCH($P$2,$H$6:$H$24,1)+1,MATCH(R4,$I$5:$M$5,0))-INDEX($I$6:$M$24,MATCH($P$2,$H$6:$H$24,1),MATCH(R4,$I$5:$M$5,0)))/(INDEX($H$6:$H$24,MATCH($P$2,$H$6:$H$24,1)+1)-INDEX($H$6:$H$24,MATCH($P$2,$H$6:$H$24,1))),INDEX($I$6:$M$24,MATCH($P$2,$H$6:$H$24,0),MATCH(R4,$I$5:$M$5,0)))","v":{"$error":"#N/A"}},{"$f":"IF(ISERROR(MATCH($P$2,$H$6:$H$24,0)),VLOOKUP($P$2,$H$6:$M$24,MATCH(S4,$I$5:$M$5,0)+1,TRUE)+($P$2-VLOOKUP($P$2,$H$6:$H$24,1,TRUE))*(INDEX($I$6:$M$24,MATCH($P$2,$H$6:$H$24,1)+1,MATCH(S4,$I$5:$M$5,0))-INDEX($I$6:$M$24,MATCH($P$2,$H$6:$H$24,1),MATCH(S4,$I$5:$M$5,0)))/(INDEX($H$6:$H$24,MATCH($P$2,$H$6:$H$24,1)+1)-INDEX($H$6:$H$24,MATCH($P$2,$H$6:$H$24,1))),INDEX($I$6:$M$24,MATCH($P$2,$H$6:$H$24,0),MATCH(S4,$I$5:$M$5,0)))","v":{"$error":"#N/A"}},{"$f":"IF(ISERROR(MATCH($P$2,$H$6:$H$24,0)),VLOOKUP($P$2,$H$6:$M$24,MATCH(T4,$I$5:$M$5,0)+1,TRUE)+($P$2-VLOOKUP($P$2,$H$6:$H$24,1,TRUE))*(INDEX($I$6:$M$24,MATCH($P$2,$H$6:$H$24,1)+1,MATCH(T4,$I$5:$M$5,0))-INDEX($I$6:$M$24,MATCH($P$2,$H$6:$H$24,1),MATCH(T4,$I$5:$M$5,0)))/(INDEX($H$6:$H$24,MATCH($P$2,$H$6:$H$24,1)+1)-INDEX($H$6:$H$24,MATCH($P$2,$H$6:$H$24,1))),INDEX($I$6:$M$24,MATCH($P$2,$H$6:$H$24,0),MATCH(T4,$I$5:$M$5,0)))","v":{"$error":"#N/A"}}]
[100,350,213.5,148.80000000000001,110.5,66.7,null,1,{"$f":"+B7/1609.347","v":0.21747951187655615},{"$f":"+C7/1609.347","v":0.13266250224469925},{"$f":"+D7/1609.347","v":9.2459861049233025E-2},{"$f":"+E7/1609.347","v":6.8661388749598443E-2},{"$f":"+F7/1609.347","v":4.1445381263332276E-2}]
[200,496.7,320.39999999999998,220.5,146.30000000000001,73,null,2,0.30863449585452979,0.19908695887213881,0.13701209248223037,9.090643596440047E-2,4.536001247711028E-2]
[300,610.20000000000005,385.6,265,180,85,null,3,0.37915999470592732,0.2396002850845716,0.16466305899224964,0.11184660610794316,5.2816452884306496E-2]
[400,705,450,296,200,90.4,null,4,0.4380658739227774,0.27961651526985792,0.1839255300441732,0.12427400678660351,5.6171851067544791E-2]
[500,795,500,340.2,220.1,98,null,5,0.49398917697674893,0.3106850169665088,0.21139008554401256,0.13676354446865716,6.0894263325435724E-2]
[1000,1135.0999999999999,700,470.6,281,97.8,null,10,0.70531712551736814,0.43495902375311229,0.29241673796887807,0.17460497953517792,6.0769989318649117E-2]
[2000,1505.5,975.6,579.5,316.39999999999998,142,null,20,0.93547258608615791,0.60620860510505192,0.3600839346641837,0.19660147873640674,8.8234544818488497E-2]
[3000,1736,1063,657.9,318.7,141.80000000000001,null,30,1.0786983789077185,0.66051634607079768,0.40879934532453222,0.19803062981445269,8.8110270811701891E-2]
[4000,1965.3,1149.4000000000001,736.2,335.7,136.5,null,40,1.2211785276885594,0.7142027170026104,0.45745261898148754,0.208593920391314,8.4817009631856899E-2]
[]
[]
[]
[]
[]
[]
[]
[]
[]
[]
[]
["Scottsbluff, NE-AERMOD setback distances (SE) as reported in the Odor Footprint Tool"]
[]
["Setback Distances (m) for Scottsbluff, SE Direction",null,null,null,null,null,null,"Setback Distances (mi) for Scottsbluff, SE Direction"]
["x 104","Annoyance Free Percentage",null,null,null,null,null,"x 106","Annoyance Free Percentage"]
["OU/s",99,98,96,94,90,null,"OU/s",99,98,96,94,90,null,"Separation distance",{"$f":"IF(ISERROR(MATCH($P$1,$H$32:$H$50,0)),VLOOKUP($P$1,$H$32:$M$50,MATCH(P$4,$I$31:$M$31,0)+1,TRUE)+($P$1-VLOOKUP($P$1,$H$32:$H$50,1,TRUE))*(INDEX($I$32:$M$50,MATCH($P$1,$H$32:$H$50,1)+1,MATCH(P$4,$I$31:$M$31,0))-INDEX($I$32:$M$50,MATCH($P$1,$H$32:$H$50,1),MATCH(P$4,$I$31:$M$31,0)))/(INDEX($H$32:$H$50,MATCH($P$1,$H$32:$H$50,1)+1)-INDEX($H$32:$H$50,MATCH($P$1,$H$32:$H$50,1))),INDEX($I$32:$M$50,MATCH($P$1,$H$32:$H$50,0),MATCH(P4,$I$31:$M$31,0)))","v":{"$error":"#N/A"}},{"$f":"IF(ISERROR(MATCH($P$1,$H$32:$H$50,0)),VLOOKUP($P$1,$H$32:$M$50,MATCH(Q$4,$I$31:$M$31,0)+1,TRUE)+($P$1-VLOOKUP($P$1,$H$32:$H$50,1,TRUE))*(INDEX($I$32:$M$50,MATCH($P$1,$H$32:$H$50,1)+1,MATCH(Q$4,$I$31:$M$31,0))-INDEX($I$32:$M$50,MATCH($P$1,$H$32:$H$50,1),MATCH(Q$4,$I$31:$M$31,0)))/(INDEX($H$32:$H$50,MATCH($P$1,$H$32:$H$50,1)+1)-INDEX($H$32:$H$50,MATCH($P$1,$H$32:$H$50,1))),INDEX($I$32:$M$50,MATCH($P$1,$H$32:$H$50,0),MATCH(Q4,$I$31:$M$31,0)))","v":{"$error":"#N/A"}},{"$f":"IF(ISERROR(MATCH($P$1,$H$32:$H$50,0)),VLOOKUP($P$1,$H$32:$M$50,MATCH(R$4,$I$31:$M$31,0)+1,TRUE)+($P$1-VLOOKUP($P$1,$H$32:$H$50,1,TRUE))*(INDEX($I$32:$M$50,MATCH($P$1,$H$32:$H$50,1)+1,MATCH(R$4,$I$31:$M$31,0))-INDEX($I$32:$M$50,MATCH($P$1,$H$32:$H$50,1),MATCH(R$4,$I$31:$M$31,0)))/(INDEX($H$32:$H$50,MATCH($P$1,$H$32:$H$50,1)+1)-INDEX($H$32:$H$50,MATCH($P$1,$H$32:$H$50,1))),INDEX($I$32:$M$50,MATCH($P$1,$H$32:$H$50,0),MATCH(R4,$I$31:$M$31,0)))","v":{"$error":"#N/A"}},{"$f":"IF(ISERROR(MATCH($P$1,$H$32:$H$50,0)),VLOOKUP($P$1,$H$32:$M$50,MATCH(S$4,$I$31:$M$31,0)+1,TRUE)+($P$1-VLOOKUP($P$1,$H$32:$H$50,1,TRUE))*(INDEX($I$32:$M$50,MATCH($P$1,$H$32:$H$50,1)+1,MATCH(S$4,$I$31:$M$31,0))-INDEX($I$32:$M$50,MATCH($P$1,$H$32:$H$50,1),MATCH(S$4,$I$31:$M$31,0)))/(INDEX($H$32:$H$50,MATCH($P$1,$H$32:$H$50,1)+1)-INDEX($H$32:$H$50,MATCH($P$1,$H$32:$H$50,1))),INDEX($I$32:$M$50,MATCH($P$1,$H$32:$H$50,0),MATCH(S4,$I$31:$M$31,0)))","v":{"$error":"#N/A"}},{"$f":"IF(ISERROR(MATCH($P$1,$H$32:$H$50,0)),VLOOKUP($P$1,$H$32:$M$50,MATCH(T$4,$I$31:$M$31,0)+1,TRUE)+($P$1-VLOOKUP($P$1,$H$32:$H$50,1,TRUE))*(INDEX($I$32:$M$50,MATCH($P$1,$H$32:$H$50,1)+1,MATCH(T$4,$I$31:$M$31,0))-INDEX($I$32:$M$50,MATCH($P$1,$H$32:$H$50,1),MATCH(T$4,$I$31:$M$31,0)))/(INDEX($H$32:$H$50,MATCH($P$1,$H$32:$H$50,1)+1)-INDEX($H$32:$H$50,MATCH($P$1,$H$32:$H$50,1))),INDEX($I$32:$M$50,MATCH($P$1,$H$32:$H$50,0),MATCH(T4,$I$31:$M$31,0)))","v":{"$error":"#N/A"}}]
[0,0,0,0,0,0,null,{"$f":"A32/100","v":0},0,0,0,0,0,null,"New Separation distance",{"$f":"IF(ISERROR(MATCH($P$2,$H$32:$H$50,0)),VLOOKUP($P$2,$H$32:$M$50,MATCH(P$4,$I$31:$M$31,0)+1,TRUE)+($P$2-VLOOKUP($P$2,$H$32:$H$50,1,TRUE))*(INDEX($I$32:$M$50,MATCH($P$2,$H$32:$H$50,1)+1,MATCH(P$4,$I$31:$M$31,0))-INDEX($I$32:$M$50,MATCH($P$2,$H$32:$H$50,1),MATCH(P$4,$I$31:$M$31,0)))/(INDEX($H$32:$H$50,MATCH($P$2,$H$32:$H$50,1)+1)-INDEX($H$32:$H$50,MATCH($P$2,$H$32:$H$50,1))),INDEX($I$32:$M$50,MATCH($P$2,$H$32:$H$50,0),MATCH(P4,$I$31:$M$31,0)))","v":{"$error":"#N/A"}},{"$f":"IF(ISERROR(MATCH($P$2,$H$32:$H$50,0)),VLOOKUP($P$2,$H$32:$M$50,MATCH(Q$4,$I$31:$M$31,0)+1,TRUE)+($P$2-VLOOKUP($P$2,$H$32:$H$50,1,TRUE))*(INDEX($I$32:$M$50,MATCH($P$2,$H$32:$H$50,1)+1,MATCH(Q$4,$I$31:$M$31,0))-INDEX($I$32:$M$50,MATCH($P$2,$H$32:$H$50,1),MATCH(Q$4,$I$31:$M$31,0)))/(INDEX($H$32:$H$50,MATCH($P$2,$H$32:$H$50,1)+1)-INDEX($H$32:$H$50,MATCH($P$2,$H$32:$H$50,1))),INDEX($I$32:$M$50,MATCH($P$2,$H$32:$H$50,0),MATCH(Q4,$I$31:$M$31,0)))","v":{"$error":"#N/A"}},{"$f":"IF(ISERROR(MATCH($P$2,$H$32:$H$50,0)),VLOOKUP($P$2,$H$32:$M$50,MATCH(R$4,$I$31:$M$31,0)+1,TRUE)+($P$2-VLOOKUP($P$2,$H$32:$H$50,1,TRUE))*(INDEX($I$32:$M$50,MATCH($P$2,$H$32:$H$50,1)+1,MATCH(R$4,$I$31:$M$31,0))-INDEX($I$32:$M$50,MATCH($P$2,$H$32:$H$50,1),MATCH(R$4,$I$31:$M$31,0)))/(INDEX($H$32:$H$50,MATCH($P$2,$H$32:$H$50,1)+1)-INDEX($H$32:$H$50,MATCH($P$2,$H$32:$H$50,1))),INDEX($I$32:$M$50,MATCH($P$2,$H$32:$H$50,0),MATCH(R4,$I$31:$M$31,0)))","v":{"$error":"#N/A"}},{"$f":"IF(ISERROR(MATCH($P$2,$H$32:$H$50,0)),VLOOKUP($P$2,$H$32:$M$50,MATCH(S$4,$I$31:$M$31,0)+1,TRUE)+($P$2-VLOOKUP($P$2,$H$32:$H$50,1,TRUE))*(INDEX($I$32:$M$50,MATCH($P$2,$H$32:$H$50,1)+1,MATCH(S$4,$I$31:$M$31,0))-INDEX($I$32:$M$50,MATCH($P$2,$H$32:$H$50,1),MATCH(S$4,$I$31:$M$31,0)))/(INDEX($H$32:$H$50,MATCH($P$2,$H$32:$H$50,1)+1)-INDEX($H$32:$H$50,MATCH($P$2,$H$32:$H$50,1))),INDEX($I$32:$M$50,MATCH($P$2,$H$32:$H$50,0),MATCH(S4,$I$31:$M$31,0)))","v":{"$error":"#N/A"}},{"$f":"IF(ISERROR(MATCH($P$2,$H$32:$H$50,0)),VLOOKUP($P$2,$H$32:$M$50,MATCH(T$4,$I$31:$M$31,0)+1,TRUE)+($P$2-VLOOKUP($P$2,$H$32:$H$50,1,TRUE))*(INDEX($I$32:$M$50,MATCH($P$2,$H$32:$H$50,1)+1,MATCH(T$4,$I$31:$M$31,0))-INDEX($I$32:$M$50,MATCH($P$2,$H$32:$H$50,1),MATCH(T$4,$I$31:$M$31,0)))/(INDEX($H$32:$H$50,MATCH($P$2,$H$32:$H$50,1)+1)-INDEX($H$32:$H$50,MATCH($P$2,$H$32:$H$50,1))),INDEX($I$32:$M$50,MATCH($P$2,$H$32:$H$50,0),MATCH(T4,$I$31:$M$31,0)))","v":{"$error":"#N/A"}}]
[100,910.2,555.9,331.3,260.3,198.1,null,1,{"$f":"+B33/1609.347","v":0.56557100488583256},{"$f":"+C33/1609.347","v":0.34541960186336446},{"$f":"+D33/1609.347","v":0.20585989224200874},{"$f":"+E33/1609.347","v":0.16174261983276447},{"$f":"+F33/1609.347","v":0.12309340372213078}]
[200,1356.8,819.5,492,371.1,277.5,null,2,0.84307486204031823,0.50921274280810791,0.30571405669504464,0.23059041959254284,0.17243018441641236]
[300,1728.5,1038.5,596.70000000000005,467.4,338.5,null,3,1.0740381036532209,0.6452927802394387,0.37077149924783159,0.29042835386029242,0.21033375648632643]
[400,2024.8,1233.7,708.1,534.79999999999995,392.2,null,4,1.258150044707574,0.76658421086316375,0.43999212102796975,0.33230869414737774,0.24370132730852948]
[500,2337.1,1389.4,807.1,598.79999999999995,437,null,5,1.4522039063048553,0.86333152514653466,0.50150775438733852,0.37207637631909091,0.27153870482872866]
[1000,3526,2083.8000000000002,1148.4000000000001,847.1,614.29999999999995,null,10,2.1909507396478198,1.294810876709622,0.71358134696867748,0.52636255574465918,0.38170761184505264]
[2000,5352.9,3072.9,1671.3,1199.0999999999999,808.2,null,20,3.3261316546400495,1.9094079772727697,1.0384957377122521,0.74508480768908125,0.50219126142466486]
[3000,6300,3600,1870,1300,870,null,30,3.9146312137780108,2.2369321221588634,1.1619619634547429,0.80778104411292284,0.5405919295217253]
[4000,6826.8,3934.1,2070.3000000000002,1470.3,944.2,null,40,4.2419689476539242,2.4445318504958844,1.2864223812515263,0.9136003608917157,0.58669758603955524]
[]
[]
[]
[]
[]
[]
[]
[]
[]
[]
[]
["Scottsbluff, NE - AERMOD setback distances (SW) as reported in the Odor Footprint Tool"]
[]
["Setback Distances (m) for Scottsbluff, SW Direction",null,null,null,null,null,null,"Setback Distances (mi) for Scottsbluff, SW Direction"]
["x 104","Annoyance Free Percentage",null,null,null,null,null,"x 106","Annoyance Free Percentage"]
["OU/s",99,98,96,94,90,null,"OU/s",99,98,96,94,90,null,"Separation distance",{"$f":"IF(ISERROR(MATCH($P$1,$H$58:$H$76,0)),VLOOKUP($P$1,$H$58:$M$76,MATCH(P$4,$I$57:$M$57,0)+1,TRUE)+($P$1-VLOOKUP($P$1,$H$58:$H$76,1,TRUE))*(INDEX($I$58:$M$76,MATCH($P$1,$H$58:$H$76,1)+1,MATCH(P$4,$I$57:$M$57,0))-INDEX($I$58:$M$76,MATCH($P$1,$H$58:$H$76,1),MATCH(P$4,$I$57:$M$57,0)))/(INDEX($H$58:$H$76,MATCH($P$1,$H$58:$H$76,1)+1)-INDEX($H$58:$H$76,MATCH($P$1,$H$58:$H$76,1))),INDEX($I$58:$M$76,MATCH($P$1,$H$58:$H$76,0),MATCH(P$4,$I$57:$M$57,0)))","v":{"$error":"#N/A"}},{"$f":"IF(ISERROR(MATCH($P$1,$H$58:$H$76,0)),VLOOKUP($P$1,$H$58:$M$76,MATCH(Q$4,$I$57:$M$57,0)+1,TRUE)+($P$1-VLOOKUP($P$1,$H$58:$H$76,1,TRUE))*(INDEX($I$58:$M$76,MATCH($P$1,$H$58:$H$76,1)+1,MATCH(Q$4,$I$57:$M$57,0))-INDEX($I$58:$M$76,MATCH($P$1,$H$58:$H$76,1),MATCH(Q$4,$I$57:$M$57,0)))/(INDEX($H$58:$H$76,MATCH($P$1,$H$58:$H$76,1)+1)-INDEX($H$58:$H$76,MATCH($P$1,$H$58:$H$76,1))),INDEX($I$58:$M$76,MATCH($P$1,$H$58:$H$76,0),MATCH(Q$4,$I$57:$M$57,0)))","v":{"$error":"#N/A"}},{"$f":"IF(ISERROR(MATCH($P$1,$H$58:$H$76,0)),VLOOKUP($P$1,$H$58:$M$76,MATCH(R$4,$I$57:$M$57,0)+1,TRUE)+($P$1-VLOOKUP($P$1,$H$58:$H$76,1,TRUE))*(INDEX($I$58:$M$76,MATCH($P$1,$H$58:$H$76,1)+1,MATCH(R$4,$I$57:$M$57,0))-INDEX($I$58:$M$76,MATCH($P$1,$H$58:$H$76,1),MATCH(R$4,$I$57:$M$57,0)))/(INDEX($H$58:$H$76,MATCH($P$1,$H$58:$H$76,1)+1)-INDEX($H$58:$H$76,MATCH($P$1,$H$58:$H$76,1))),INDEX($I$58:$M$76,MATCH($P$1,$H$58:$H$76,0),MATCH(R$4,$I$57:$M$57,0)))","v":{"$error":"#N/A"}},{"$f":"IF(ISERROR(MATCH($P$1,$H$58:$H$76,0)),VLOOKUP($P$1,$H$58:$M$76,MATCH(S$4,$I$57:$M$57,0)+1,TRUE)+($P$1-VLOOKUP($P$1,$H$58:$H$76,1,TRUE))*(INDEX($I$58:$M$76,MATCH($P$1,$H$58:$H$76,1)+1,MATCH(S$4,$I$57:$M$57,0))-INDEX($I$58:$M$76,MATCH($P$1,$H$58:$H$76,1),MATCH(S$4,$I$57:$M$57,0)))/(INDEX($H$58:$H$76,MATCH($P$1,$H$58:$H$76,1)+1)-INDEX($H$58:$H$76,MATCH($P$1,$H$58:$H$76,1))),INDEX($I$58:$M$76,MATCH($P$1,$H$58:$H$76,0),MATCH(S$4,$I$57:$M$57,0)))","v":{"$error":"#N/A"}},{"$f":"IF(ISERROR(MATCH($P$1,$H$58:$H$76,0)),VLOOKUP($P$1,$H$58:$M$76,MATCH(T$4,$I$57:$M$57,0)+1,TRUE)+($P$1-VLOOKUP($P$1,$H$58:$H$76,1,TRUE))*(INDEX($I$58:$M$76,MATCH($P$1,$H$58:$H$76,1)+1,MATCH(T$4,$I$57:$M$57,0))-INDEX($I$58:$M$76,MATCH($P$1,$H$58:$H$76,1),MATCH(T$4,$I$57:$M$57,0)))/(INDEX($H$58:$H$76,MATCH($P$1,$H$58:$H$76,1)+1)-INDEX($H$58:$H$76,MATCH($P$1,$H$58:$H$76,1))),INDEX($I$58:$M$76,MATCH($P$1,$H$58:$H$76,0),MATCH(T$4,$I$57:$M$57,0)))","v":{"$error":"#N/A"}}]
[0,0,0,0,0,0,null,{"$f":"A58/100","v":0},0,0,0,0,0,null,"New Separation distance",{"$f":"IF(ISERROR(MATCH($P$2,$H$58:$H$76,0)),VLOOKUP($P$2,$H$58:$M$76,MATCH(P$4,$I$57:$M$57,0)+1,TRUE)+($P$2-VLOOKUP($P$2,$H$58:$H$76,1,TRUE))*(INDEX($I$58:$M$76,MATCH($P$2,$H$58:$H$76,1)+1,MATCH(P$4,$I$57:$M$57,0))-INDEX($I$58:$M$76,MATCH($P$2,$H$58:$H$76,1),MATCH(P$4,$I$57:$M$57,0)))/(INDEX($H$58:$H$76,MATCH($P$2,$H$58:$H$76,1)+1)-INDEX($H$58:$H$76,MATCH($P$2,$H$58:$H$76,1))),INDEX($I$58:$M$76,MATCH($P$2,$H$58:$H$76,0),MATCH(P4,$I$57:$M$57,0)))","v":{"$error":"#N/A"}},{"$f":"IF(ISERROR(MATCH($P$2,$H$58:$H$76,0)),VLOOKUP($P$2,$H$58:$M$76,MATCH(Q$4,$I$57:$M$57,0)+1,TRUE)+($P$2-VLOOKUP($P$2,$H$58:$H$76,1,TRUE))*(INDEX($I$58:$M$76,MATCH($P$2,$H$58:$H$76,1)+1,MATCH(Q$4,$I$57:$M$57,0))-INDEX($I$58:$M$76,MATCH($P$2,$H$58:$H$76,1),MATCH(Q$4,$I$57:$M$57,0)))/(INDEX($H$58:$H$76,MATCH($P$2,$H$58:$H$76,1)+1)-INDEX($H$58:$H$76,MATCH($P$2,$H$58:$H$76,1))),INDEX($I$58:$M$76,MATCH($P$2,$H$58:$H$76,0),MATCH(Q4,$I$57:$M$57,0)))","v":{"$error":"#N/A"}},{"$f":"IF(ISERROR(MATCH($P$2,$H$58:$H$76,0)),VLOOKUP($P$2,$H$58:$M$76,MATCH(R$4,$I$57:$M$57,0)+1,TRUE)+($P$2-VLOOKUP($P$2,$H$58:$H$76,1,TRUE))*(INDEX($I$58:$M$76,MATCH($P$2,$H$58:$H$76,1)+1,MATCH(R$4,$I$57:$M$57,0))-INDEX($I$58:$M$76,MATCH($P$2,$H$58:$H$76,1),MATCH(R$4,$I$57:$M$57,0)))/(INDEX($H$58:$H$76,MATCH($P$2,$H$58:$H$76,1)+1)-INDEX($H$58:$H$76,MATCH($P$2,$H$58:$H$76,1))),INDEX($I$58:$M$76,MATCH($P$2,$H$58:$H$76,0),MATCH(R4,$I$57:$M$57,0)))","v":{"$error":"#N/A"}},{"$f":"IF(ISERROR(MATCH($P$2,$H$58:$H$76,0)),VLOOKUP($P$2,$H$58:$M$76,MATCH(S$4,$I$57:$M$57,0)+1,TRUE)+($P$2-VLOOKUP($P$2,$H$58:$H$76,1,TRUE))*(INDEX($I$58:$M$76,MATCH($P$2,$H$58:$H$76,1)+1,MATCH(S$4,$I$57:$M$57,0))-INDEX($I$58:$M$76,MATCH($P$2,$H$58:$H$76,1),MATCH(S$4,$I$57:$M$57,0)))/(INDEX($H$58:$H$76,MATCH($P$2,$H$58:$H$76,1)+1)-INDEX($H$58:$H$76,MATCH($P$2,$H$58:$H$76,1))),INDEX($I$58:$M$76,MATCH($P$2,$H$58:$H$76,0),MATCH(S4,$I$57:$M$57,0)))","v":{"$error":"#N/A"}},{"$f":"IF(ISERROR(MATCH($P$2,$H$58:$H$76,0)),VLOOKUP($P$2,$H$58:$M$76,MATCH(T$4,$I$57:$M$57,0)+1,TRUE)+($P$2-VLOOKUP($P$2,$H$58:$H$76,1,TRUE))*(INDEX($I$58:$M$76,MATCH($P$2,$H$58:$H$76,1)+1,MATCH(T$4,$I$57:$M$57,0))-INDEX($I$58:$M$76,MATCH($P$2,$H$58:$H$76,1),MATCH(T$4,$I$57:$M$57,0)))/(INDEX($H$58:$H$76,MATCH($P$2,$H$58:$H$76,1)+1)-INDEX($H$58:$H$76,MATCH($P$2,$H$58:$H$76,1))),INDEX($I$58:$M$76,MATCH($P$2,$H$58:$H$76,0),MATCH(T4,$I$57:$M$57,0)))","v":{"$error":"#N/A"}}]
[100,769.2,467.2,295.89999999999998,233.5,169.2,null,1,{"$f":"+B59/1609.347","v":0.47795783010127713},{"$f":"+C59/1609.347","v":0.29030407985350581},{"$f":"+D59/1609.347","v":0.18386339304077989},{"$f":"+E59/1609.347","v":0.1450899029233596},{"$f":"+F59/1609.347","v":0.10513580974146657}]
[200,1141.4000000000001,703.2,432.2,334.5,233,null,2,0.70923175673114625,0.436947407861698,0.26855612866585016,0.20784827635059439,0.14477921790639309]
[300,1444,889.5,533.1,406.4,280.7,null,3,0.89725832899927738,0.55270864518341911,0.33125236508969169,0.25252478179037835,0.17441856852499801]
[400,1726,1044.2,618.9,460.6,301.60000000000002,null,4,1.0724846785683884,0.64883458943285699,0.38456591400114454,0.28620303762954791,0.1874052022341981]
[500,1955.9,1185.2,696.4,528.9,351.3,null,5,1.2153376493695891,0.73644776421741243,0.43272209163095343,0.32864261094717295,0.21828729292066906]
[1000,2907,1730.4,1016.6,757.7,486.5,null,10,1.8063226886432822,1.0752187067176937,0.63168477649630561,0.47081207471104741,0.30229652150841302]
[2000,4302.8999999999996,2566.1999999999998,1431.3,999.2,550.4,null,20,2.6736931190103812,1.5945597810789096,0.88936692956832797,0.62087293790587117,0.34200206667673283]
[3000,5000,3100,1600,1070.7,627.5,null,30,3.1068501696650879,1.9262471051923544,0.99419205429282809,0.66530089533208192,0.38990969629296851]
[4000,5480.7,3317.5,1786.4,1227.5,663.8,null,40,3.4055427449766893,2.0613950875727856,1.1100154286179427,0.76273171665277906,0.41246542852473705]
[]
[]
[]
[]
[]
[]
[]
[]
[]
[]
[]
["Scottsbluff, NE - AERMOD setback distances (NW) as reported in the Odor Footprint Tool"]
[]
["Setback Distances (m) for Scottsbluff, NW Direction",null,null,null,null,null,null,"Setback Distances (mi) for Scottsbluff, NW Direction"]
["x 104","Annoyance Free Percentage",null,null,null,null,null,"x 106","Annoyance Free Percentage"]
["OU/s",99,98,96,94,90,null,"OU/s",99,98,96,94,90,null,"Separation distance",{"$f":"IF(ISERROR(MATCH($P$1,$H$84:$H$102,0)),VLOOKUP($P$1,$H$84:$M$102,MATCH(P$4,$I$83:$M$83,0)+1,TRUE)+($P$1-VLOOKUP($P$1,$H$84:$H$102,1,TRUE))*(INDEX($I$84:$M$102,MATCH($P$1,$H$84:$H$102,1)+1,MATCH(P$4,$I$83:$M$83,0))-INDEX($I$84:$M$102,MATCH($P$1,$H$84:$H$102,1),MATCH(P$4,$I$83:$M$83,0)))/(INDEX($H$84:$H$102,MATCH($P$1,$H$84:$H$102,1)+1)-INDEX($H$84:$H$102,MATCH($P$1,$H$84:$H$102,1))),INDEX($I$84:$M$102,MATCH($P$1,$H$84:$H$102,0),MATCH(P4,$I$83:$M$83,0)))","v":{"$error":"#N/A"}},{"$f":"IF(ISERROR(MATCH($P$1,$H$84:$H$102,0)),VLOOKUP($P$1,$H$84:$M$102,MATCH(Q$4,$I$83:$M$83,0)+1,TRUE)+($P$1-VLOOKUP($P$1,$H$84:$H$102,1,TRUE))*(INDEX($I$84:$M$102,MATCH($P$1,$H$84:$H$102,1)+1,MATCH(Q$4,$I$83:$M$83,0))-INDEX($I$84:$M$102,MATCH($P$1,$H$84:$H$102,1),MATCH(Q$4,$I$83:$M$83,0)))/(INDEX($H$84:$H$102,MATCH($P$1,$H$84:$H$102,1)+1)-INDEX($H$84:$H$102,MATCH($P$1,$H$84:$H$102,1))),INDEX($I$84:$M$102,MATCH($P$1,$H$84:$H$102,0),MATCH(Q4,$I$83:$M$83,0)))","v":{"$error":"#N/A"}},{"$f":"IF(ISERROR(MATCH($P$1,$H$84:$H$102,0)),VLOOKUP($P$1,$H$84:$M$102,MATCH(R$4,$I$83:$M$83,0)+1,TRUE)+($P$1-VLOOKUP($P$1,$H$84:$H$102,1,TRUE))*(INDEX($I$84:$M$102,MATCH($P$1,$H$84:$H$102,1)+1,MATCH(R$4,$I$83:$M$83,0))-INDEX($I$84:$M$102,MATCH($P$1,$H$84:$H$102,1),MATCH(R$4,$I$83:$M$83,0)))/(INDEX($H$84:$H$102,MATCH($P$1,$H$84:$H$102,1)+1)-INDEX($H$84:$H$102,MATCH($P$1,$H$84:$H$102,1))),INDEX($I$84:$M$102,MATCH($P$1,$H$84:$H$102,0),MATCH(R4,$I$83:$M$83,0)))","v":{"$error":"#N/A"}},{"$f":"IF(ISERROR(MATCH($P$1,$H$84:$H$102,0)),VLOOKUP($P$1,$H$84:$M$102,MATCH(S$4,$I$83:$M$83,0)+1,TRUE)+($P$1-VLOOKUP($P$1,$H$84:$H$102,1,TRUE))*(INDEX($I$84:$M$102,MATCH($P$1,$H$84:$H$102,1)+1,MATCH(S$4,$I$83:$M$83,0))-INDEX($I$84:$M$102,MATCH($P$1,$H$84:$H$102,1),MATCH(S$4,$I$83:$M$83,0)))/(INDEX($H$84:$H$102,MATCH($P$1,$H$84:$H$102,1)+1)-INDEX($H$84:$H$102,MATCH($P$1,$H$84:$H$102,1))),INDEX($I$84:$M$102,MATCH($P$1,$H$84:$H$102,0),MATCH(S4,$I$83:$M$83,0)))","v":{"$error":"#N/A"}},{"$f":"IF(ISERROR(MATCH($P$1,$H$84:$H$102,0)),VLOOKUP($P$1,$H$84:$M$102,MATCH(T$4,$I$83:$M$83,0)+1,TRUE)+($P$1-VLOOKUP($P$1,$H$84:$H$102,1,TRUE))*(INDEX($I$84:$M$102,MATCH($P$1,$H$84:$H$102,1)+1,MATCH(T$4,$I$83:$M$83,0))-INDEX($I$84:$M$102,MATCH($P$1,$H$84:$H$102,1),MATCH(T$4,$I$83:$M$83,0)))/(INDEX($H$84:$H$102,MATCH($P$1,$H$84:$H$102,1)+1)-INDEX($H$84:$H$102,MATCH($P$1,$H$84:$H$102,1))),INDEX($I$84:$M$102,MATCH($P$1,$H$84:$H$102,0),MATCH(T4,$I$83:$M$83,0)))","v":{"$error":"#N/A"}}]
[0,0,0,0,0,0,null,{"$f":"A84/100","v":0},0,0,0,0,0,null,"New Separation distance",{"$f":"IF(ISERROR(MATCH($P$2,$H$84:$H$102,0)),VLOOKUP($P$2,$H$84:$M$102,MATCH(P$4,$I$83:$M$83,0)+1,TRUE)+($P$2-VLOOKUP($P$2,$H$84:$H$102,1,TRUE))*(INDEX($I$84:$M$102,MATCH($P$2,$H$84:$H$102,1)+1,MATCH(P$4,$I$83:$M$83,0))-INDEX($I$84:$M$102,MATCH($P$2,$H$84:$H$102,1),MATCH(P$4,$I$83:$M$83,0)))/(INDEX($H$84:$H$102,MATCH($P$2,$H$84:$H$102,1)+1)-INDEX($H$84:$H$102,MATCH($P$2,$H$84:$H$102,1))),INDEX($I$84:$M$102,MATCH($P$2,$H$84:$H$102,0),MATCH(P4,$I$83:$M$83,0)))","v":{"$error":"#N/A"}},{"$f":"IF(ISERROR(MATCH($P$2,$H$84:$H$102,0)),VLOOKUP($P$2,$H$84:$M$102,MATCH(Q$4,$I$83:$M$83,0)+1,TRUE)+($P$2-VLOOKUP($P$2,$H$84:$H$102,1,TRUE))*(INDEX($I$84:$M$102,MATCH($P$2,$H$84:$H$102,1)+1,MATCH(Q$4,$I$83:$M$83,0))-INDEX($I$84:$M$102,MATCH($P$2,$H$84:$H$102,1),MATCH(Q$4,$I$83:$M$83,0)))/(INDEX($H$84:$H$102,MATCH($P$2,$H$84:$H$102,1)+1)-INDEX($H$84:$H$102,MATCH($P$2,$H$84:$H$102,1))),INDEX($I$84:$M$102,MATCH($P$2,$H$84:$H$102,0),MATCH(Q4,$I$83:$M$83,0)))","v":{"$error":"#N/A"}},{"$f":"IF(ISERROR(MATCH($P$2,$H$84:$H$102,0)),VLOOKUP($P$2,$H$84:$M$102,MATCH(R$4,$I$83:$M$83,0)+1,TRUE)+($P$2-VLOOKUP($P$2,$H$84:$H$102,1,TRUE))*(INDEX($I$84:$M$102,MATCH($P$2,$H$84:$H$102,1)+1,MATCH(R$4,$I$83:$M$83,0))-INDEX($I$84:$M$102,MATCH($P$2,$H$84:$H$102,1),MATCH(R$4,$I$83:$M$83,0)))/(INDEX($H$84:$H$102,MATCH($P$2,$H$84:$H$102,1)+1)-INDEX($H$84:$H$102,MATCH($P$2,$H$84:$H$102,1))),INDEX($I$84:$M$102,MATCH($P$2,$H$84:$H$102,0),MATCH(R4,$I$83:$M$83,0)))","v":{"$error":"#N/A"}},{"$f":"IF(ISERROR(MATCH($P$2,$H$84:$H$102,0)),VLOOKUP($P$2,$H$84:$M$102,MATCH(S$4,$I$83:$M$83,0)+1,TRUE)+($P$2-VLOOKUP($P$2,$H$84:$H$102,1,TRUE))*(INDEX($I$84:$M$102,MATCH($P$2,$H$84:$H$102,1)+1,MATCH(S$4,$I$83:$M$83,0))-INDEX($I$84:$M$102,MATCH($P$2,$H$84:$H$102,1),MATCH(S$4,$I$83:$M$83,0)))/(INDEX($H$84:$H$102,MATCH($P$2,$H$84:$H$102,1)+1)-INDEX($H$84:$H$102,MATCH($P$2,$H$84:$H$102,1))),INDEX($I$84:$M$102,MATCH($P$2,$H$84:$H$102,0),MATCH(S4,$I$83:$M$83,0)))","v":{"$error":"#N/A"}},{"$f":"IF(ISERROR(MATCH($P$2,$H$84:$H$102,0)),VLOOKUP($P$2,$H$84:$M$102,MATCH(T$4,$I$83:$M$83,0)+1,TRUE)+($P$2-VLOOKUP($P$2,$H$84:$H$102,1,TRUE))*(INDEX($I$84:$M$102,MATCH($P$2,$H$84:$H$102,1)+1,MATCH(T$4,$I$83:$M$83,0))-INDEX($I$84:$M$102,MATCH($P$2,$H$84:$H$102,1),MATCH(T$4,$I$83:$M$83,0)))/(INDEX($H$84:$H$102,MATCH($P$2,$H$84:$H$102,1)+1)-INDEX($H$84:$H$102,MATCH($P$2,$H$84:$H$102,1))),INDEX($I$84:$M$102,MATCH($P$2,$H$84:$H$102,0),MATCH(T4,$I$83:$M$83,0)))","v":{"$error":"#N/A"}}]
[100,739,466.3,303,238.2,176.1,null,1,{"$f":"+B85/1609.347","v":0.45919245507649997},{"$f":"+C85/1609.347","v":0.28974484682296608},{"$f":"+D85/1609.347","v":0.18827512028170432},{"$f":"+E85/1609.347","v":0.14801034208284478},{"$f":"+F85/1609.347","v":0.10942326297560438}]
[200,1120.3,711.9,444.3,343.5,246.8,null,2,0.69612084901515958,0.44235332715691517,0.27607470607643969,0.21344060665599154,0.15335412437466875]
[300,1451.7,890.5,548.1,419.1,297.7,null,3,0.90204287826056162,0.55333001521735214,0.34057291559868696,0.26041618122132765,0.18498185910185933]
[400,1710,1053.5,632,484,341.9,null,4,1.0625427580254601,0.65461333074843397,0.3927058614456671,0.30074309642358049,0.21244641460169869]
[500,1953.7,1180,725.1,547.29999999999995,378.3,null,5,1.2139706352949364,0.73321664004096077,0.45055541160483104,0.34007581957154048,0.23506428383686054]
[1000,2901,1702.3,1031.0999999999999,769.4,521.79999999999995,null,10,1.802594468439684,1.0577582087641757,0.64069464198833437,0.47808210410806368,0.32423088370624853]
[2000,4170,2503.1,1494.9,1078.7,678.1,null,20,2.5911130415006833,1.5553513319377361,0.92888606372646798,0.67027185560354607,0.4213510200099792]
[3000,4900,2975,1750,1225,740,null,30,3.0447131662717859,1.8485758509507273,1.0873975593827807,0.76117829156794647,0.45981382511043301]
[4000,5320.3,3250,1884.9,1311.8,814.9,null,40,3.3058749915338335,2.0194526102823072,1.1712203769603449,0.81511321051333241,0.50635444065201596]

{"sheet":"Beatrice","index":12,"n_rows":102,"n_cols":20,"rows_kept":102,"cut":false,"hidden":true,"merged":[[81,1,81,5],[81,8,81,12],[3,1,3,5],[3,8,3,12],[29,1,29,5],[29,8,29,12],[55,1,55,5],[55,8,55,12]]}
["Lincoln, NE-AERMOD setback distances (North) as reported in the Odor Footprint Tool",null,null,null,null,null,null,null,null,null,null,null,null,null,"Total Scaled Odor Emission Rate (x10^6)",{"$f":"Inputs!E33","v":""}]
[null,null,null,null,null,null,null,null,null,null,null,null,null,null,"New Total Scaled Odor Emission Rate (x10^6)",{"$f":"Inputs!E42","v":""}]
["Setback Distances (m) for Lincoln, North",null,null,null,null,null,null,"Setback Distances (mi) for Lincoln, North"]
["x 104","Annoyance Free Percentage",null,null,null,null,null,"x 106","Annoyance Free Percentage",null,null,null,null,null,"Annoyance free percentage",99,98,96,94,90]
["OU/s",99,98,96,94,90,null,"OU/s",{"$f":"B5","v":99},{"$f":"C5","v":98},{"$f":"D5","v":96},{"$f":"E5","v":94},{"$f":"F5","v":90},null,"Separation distance",{"$f":"IF(ISERROR(MATCH($P$1,$H$6:$H$24,0)),VLOOKUP($P$1,$H$6:$M$24,MATCH(P4,$I$5:$M$5,0)+1,TRUE)+($P$1-VLOOKUP($P$1,$H$6:$H$24,1,TRUE))*(INDEX($I$6:$M$24,MATCH($P$1,$H$6:$H$24,1)+1,MATCH(P4,$I$5:$M$5,0))-INDEX($I$6:$M$24,MATCH($P$1,$H$6:$H$24,1),MATCH(P4,$I$5:$M$5,0)))/(INDEX($H$6:$H$24,MATCH($P$1,$H$6:$H$24,1)+1)-INDEX($H$6:$H$24,MATCH($P$1,$H$6:$H$24,1))),INDEX($I$6:$M$24,MATCH($P$1,$H$6:$H$24,0),MATCH(P4,$I$5:$M$5,0)))","v":{"$error":"#N/A"}},{"$f":"IF(ISERROR(MATCH($P$1,$H$6:$H$24,0)),VLOOKUP($P$1,$H$6:$M$24,MATCH(Q4,$I$5:$M$5,0)+1,TRUE)+($P$1-VLOOKUP($P$1,$H$6:$H$24,1,TRUE))*(INDEX($I$6:$M$24,MATCH($P$1,$H$6:$H$24,1)+1,MATCH(Q4,$I$5:$M$5,0))-INDEX($I$6:$M$24,MATCH($P$1,$H$6:$H$24,1),MATCH(Q4,$I$5:$M$5,0)))/(INDEX($H$6:$H$24,MATCH($P$1,$H$6:$H$24,1)+1)-INDEX($H$6:$H$24,MATCH($P$1,$H$6:$H$24,1))),INDEX($I$6:$M$24,MATCH($P$1,$H$6:$H$24,0),MATCH(Q4,$I$5:$M$5,0)))","v":{"$error":"#N/A"}},{"$f":"IF(ISERROR(MATCH($P$1,$H$6:$H$24,0)),VLOOKUP($P$1,$H$6:$M$24,MATCH(R4,$I$5:$M$5,0)+1,TRUE)+($P$1-VLOOKUP($P$1,$H$6:$H$24,1,TRUE))*(INDEX($I$6:$M$24,MATCH($P$1,$H$6:$H$24,1)+1,MATCH(R4,$I$5:$M$5,0))-INDEX($I$6:$M$24,MATCH($P$1,$H$6:$H$24,1),MATCH(R4,$I$5:$M$5,0)))/(INDEX($H$6:$H$24,MATCH($P$1,$H$6:$H$24,1)+1)-INDEX($H$6:$H$24,MATCH($P$1,$H$6:$H$24,1))),INDEX($I$6:$M$24,MATCH($P$1,$H$6:$H$24,0),MATCH(R4,$I$5:$M$5,0)))","v":{"$error":"#N/A"}},{"$f":"IF(ISERROR(MATCH($P$1,$H$6:$H$24,0)),VLOOKUP($P$1,$H$6:$M$24,MATCH(S4,$I$5:$M$5,0)+1,TRUE)+($P$1-VLOOKUP($P$1,$H$6:$H$24,1,TRUE))*(INDEX($I$6:$M$24,MATCH($P$1,$H$6:$H$24,1)+1,MATCH(S4,$I$5:$M$5,0))-INDEX($I$6:$M$24,MATCH($P$1,$H$6:$H$24,1),MATCH(S4,$I$5:$M$5,0)))/(INDEX($H$6:$H$24,MATCH($P$1,$H$6:$H$24,1)+1)-INDEX($H$6:$H$24,MATCH($P$1,$H$6:$H$24,1))),INDEX($I$6:$M$24,MATCH($P$1,$H$6:$H$24,0),MATCH(S4,$I$5:$M$5,0)))","v":{"$error":"#N/A"}},{"$f":"IF(ISERROR(MATCH($P$1,$H$6:$H$24,0)),VLOOKUP($P$1,$H$6:$M$24,MATCH(T4,$I$5:$M$5,0)+1,TRUE)+($P$1-VLOOKUP($P$1,$H$6:$H$24,1,TRUE))*(INDEX($I$6:$M$24,MATCH($P$1,$H$6:$H$24,1)+1,MATCH(T4,$I$5:$M$5,0))-INDEX($I$6:$M$24,MATCH($P$1,$H$6:$H$24,1),MATCH(T4,$I$5:$M$5,0)))/(INDEX($H$6:$H$24,MATCH($P$1,$H$6:$H$24,1)+1)-INDEX($H$6:$H$24,MATCH($P$1,$H$6:$H$24,1))),INDEX($I$6:$M$24,MATCH($P$1,$H$6:$H$24,0),MATCH(T4,$I$5:$M$5,0)))","v":{"$error":"#N/A"}}]
[0,0,0,0,0,0,null,{"$f":"A6/100","v":0},0,0,0,0,0,null,"New Separation distance",{"$f":"IF(ISERROR(MATCH($P$2,$H$6:$H$24,0)),VLOOKUP($P$2,$H$6:$M$24,MATCH(P4,$I$5:$M$5,0)+1,TRUE)+($P$2-VLOOKUP($P$2,$H$6:$H$24,1,TRUE))*(INDEX($I$6:$M$24,MATCH($P$2,$H$6:$H$24,1)+1,MATCH(P4,$I$5:$M$5,0))-INDEX($I$6:$M$24,MATCH($P$2,$H$6:$H$24,1),MATCH(P4,$I$5:$M$5,0)))/(INDEX($H$6:$H$24,MATCH($P$2,$H$6:$H$24,1)+1)-INDEX($H$6:$H$24,MATCH($P$2,$H$6:$H$24,1))),INDEX($I$6:$M$24,MATCH($P$2,$H$6:$H$24,0),MATCH(P4,$I$5:$M$5,0)))","v":{"$error":"#N/A"}},{"$f":"IF(ISERROR(MATCH($P$2,$H$6:$H$24,0)),VLOOKUP($P$2,$H$6:$M$24,MATCH(Q4,$I$5:$M$5,0)+1,TRUE)+($P$2-VLOOKUP($P$2,$H$6:$H$24,1,TRUE))*(INDEX($I$6:$M$24,MATCH($P$2,$H$6:$H$24,1)+1,MATCH(Q4,$I$5:$M$5,0))-INDEX($I$6:$M$24,MATCH($P$2,$H$6:$H$24,1),MATCH(Q4,$I$5:$M$5,0)))/(INDEX($H$6:$H$24,MATCH($P$2,$H$6:$H$24,1)+1)-INDEX($H$6:$H$24,MATCH($P$2,$H$6:$H$24,1))),INDEX($I$6:$M$24,MATCH($P$2,$H$6:$H$24,0),MATCH(Q4,$I$5:$M$5,0)))","v":{"$error":"#N/A"}},{"$f":"IF(ISERROR(MATCH($P$2,$H$6:$H$24,0)),VLOOKUP($P$2,$H$6:$M$24,MATCH(R4,$I$5:$M$5,0)+1,TRUE)+($P$2-VLOOKUP($P$2,$H$6:$H$24,1,TRUE))*(INDEX($I$6:$M$24,MATCH($P$2,$H$6:$H$24,1)+1,MATCH(R4,$I$5:$M$5,0))-INDEX($I$6:$M$24,MATCH($P$2,$H$6:$H$24,1),MATCH(R4,$I$5:$M$5,0)))/(INDEX($H$6:$H$24,MATCH($P$2,$H$6:$H$24,1)+1)-INDEX($H$6:$H$24,MATCH($P$2,$H$6:$H$24,1))),INDEX($I$6:$M$24,MATCH($P$2,$H$6:$H$24,0),MATCH(R4,$I$5:$M$5,0)))","v":{"$error":"#N/A"}},{"$f":"IF(ISERROR(MATCH($P$2,$H$6:$H$24,0)),VLOOKUP($P$2,$H$6:$M$24,MATCH(S4,$I$5:$M$5,0)+1,TRUE)+($P$2-VLOOKUP($P$2,$H$6:$H$24,1,TRUE))*(INDEX($I$6:$M$24,MATCH($P$2,$H$6:$H$24,1)+1,MATCH(S4,$I$5:$M$5,0))-INDEX($I$6:$M$24,MATCH($P$2,$H$6:$H$24,1),MATCH(S4,$I$5:$M$5,0)))/(INDEX($H$6:$H$24,MATCH($P$2,$H$6:$H$24,1)+1)-INDEX($H$6:$H$24,MATCH($P$2,$H$6:$H$24,1))),INDEX($I$6:$M$24,MATCH($P$2,$H$6:$H$24,0),MATCH(S4,$I$5:$M$5,0)))","v":{"$error":"#N/A"}},{"$f":"IF(ISERROR(MATCH($P$2,$H$6:$H$24,0)),VLOOKUP($P$2,$H$6:$M$24,MATCH(T4,$I$5:$M$5,0)+1,TRUE)+($P$2-VLOOKUP($P$2,$H$6:$H$24,1,TRUE))*(INDEX($I$6:$M$24,MATCH($P$2,$H$6:$H$24,1)+1,MATCH(T4,$I$5:$M$5,0))-INDEX($I$6:$M$24,MATCH($P$2,$H$6:$H$24,1),MATCH(T4,$I$5:$M$5,0)))/(INDEX($H$6:$H$24,MATCH($P$2,$H$6:$H$24,1)+1)-INDEX($H$6:$H$24,MATCH($P$2,$H$6:$H$24,1))),INDEX($I$6:$M$24,MATCH($P$2,$H$6:$H$24,0),MATCH(T4,$I$5:$M$5,0)))","v":{"$error":"#N/A"}}]
[20,323.60000000000002,219.9,148.19999999999999,120,93.6,null,0.2,{"$f":"+B7/1609.347","v":0.20107534298072449},{"$f":"+C7/1609.347","v":0.13663927046187058},{"$f":"+D7/1609.347","v":9.2087039028873191E-2},{"$f":"+E7/1609.347","v":7.4564404071962104E-2},{"$f":"+F7/1609.347","v":5.8160235176130441E-2}]
[50,567.9,379.9,246.8,194.8,151.30000000000001,null,0.5,0.35287604227056069,0.23605847589115336,0.15335412437466875,0.12104288261015182,9.4013286134065566E-2]
[100,857.5,563.1,360.8,281.7,217,null,1,0.53282480409756261,0.34989346610768218,0.22419030824303274,0.17503993855893105,0.13483729736346481]
[200,1291.5999999999999,835.2,528.6,407.1,309.89999999999998,null,2,0.80256153582788547,0.51896825234085631,0.3284561999369931,0.25295974081413147,0.19256257351584213]
[300,1660.1,1054.2,654,501.6,381.1,null,3,1.0315363933322024,0.6550482897721871,0.4063760021921935,0.3116792090208016,0.236804119931873]
[400,1964.2,1243.0999999999999,765.9,579.6,440.3,null,4,1.2204950206512331,0.77242508918213404,0.47590730898929812,0.36014607166757701,0.27358922594070761]
[500,2243.4,1407.6,865.2,650.5,492,null,5,1.3939815341253317,0.87464045976411542,0.53760935335884685,0.40420120707342794,0.30571405669504464]
[600,2490.9,1565.2,961.1,715.5,539.6,null,6,1.5477706175237536,0.97256837711195909,0.59719873961302317,0.44459025927907408,0.3352912703102563]
[700,2743.5,1696.1,1033.5,770.2,581.1,null,7,1.7047286880952337,1.0539057145537911,0.64218593006977365,0.47857920013521016,0.3610781267184765]
[800,2958,1825.3,1106.2,825.3,622,null,8,1.838012560373866,1.134186722937937,0.68735953153670404,0.51281668900491939,0.38649216110633694]
[900,3179.3,1952.5,1169.0999999999999,878.1,661.3,null,9,1.9755217488832428,1.2132249912542168,0.72644370667109082,0.54562502679658276,0.41091200343990447]
[1000,3405.4,2063.6,1239.9000000000001,930.6,693.4,null,10,2.1160135135554983,1.282259202024175,0.77043670507354856,0.5782469535780661,0.43085798152915439]
[1500,4284,2609.6999999999998,1530.6,1146,845.9,null,15,2.6619492253690473,1.6215893775549959,0.95106897393787659,0.71209005888723809,0.52561691170393954]
[2000,5054.8,3090.3,1777.2,1316.8,971.6,null,20,3.1409012475246172,1.9202198158632042,1.1042988243057588,0.81822006068299746,0.6037231249693199]
[2500,5874.8,3506.7,2009.7,1471.1,1077.5999999999999,null,25,3.6504246753496918,2.1789582979929127,1.2487673571951854,0.91409745691886213,0.66958834856621963]
[3000,6504.5,3870.5,2195.6999999999998,1603.4,1173.5,null,30,4.041701385717313,2.4050127163377444,1.3643421835067266,0.9963047124082004,0.72917773482039616]
[3500,7079,4226.8999999999996,2381.3000000000002,1730.4,1261.4000000000001,null,35,4.3986784702118316,2.6264689964314716,1.4796684618046949,1.0752187067176937,0.78379616080310843]
[4000,7423.6,4569.3,2543.5,1854.6,1343,null,40,4.6128025839051494,2.8392260960501372,1.5804546813086302,1.1523928649321744,0.8344999555720426]
[]
[]
["Lincoln, NE-AERMOD setback distances (East) as reported in the Odor Footprint Tool"]
[]
["Setback Distances (m) for Lincoln, East",null,null,null,null,null,null,"Setback Distances (mi) for Lincoln, East"]
["x 104","Annoyance Free Percentage",null,null,null,null,null,"x 106","Annoyance Free Percentage"]
["OU/s",99,98,96,94,90,null,"OU/s",99,98,96,94,90,null,"Separation distance",{"$f":"IF(ISERROR(MATCH($P$1,$H$32:$H$50,0)),VLOOKUP($P$1,$H$32:$M$50,MATCH(P$4,$I$31:$M$31,0)+1,TRUE)+($P$1-VLOOKUP($P$1,$H$32:$H$50,1,TRUE))*(INDEX($I$32:$M$50,MATCH($P$1,$H$32:$H$50,1)+1,MATCH(P$4,$I$31:$M$31,0))-INDEX($I$32:$M$50,MATCH($P$1,$H$32:$H$50,1),MATCH(P$4,$I$31:$M$31,0)))/(INDEX($H$32:$H$50,MATCH($P$1,$H$32:$H$50,1)+1)-INDEX($H$32:$H$50,MATCH($P$1,$H$32:$H$50,1))),INDEX($I$32:$M$50,MATCH($P$1,$H$32:$H$50,0),MATCH(P4,$I$31:$M$31,0)))","v":{"$error":"#N/A"}},{"$f":"IF(ISERROR(MATCH($P$1,$H$32:$H$50,0)),VLOOKUP($P$1,$H$32:$M$50,MATCH(Q$4,$I$31:$M$31,0)+1,TRUE)+($P$1-VLOOKUP($P$1,$H$32:$H$50,1,TRUE))*(INDEX($I$32:$M$50,MATCH($P$1,$H$32:$H$50,1)+1,MATCH(Q$4,$I$31:$M$31,0))-INDEX($I$32:$M$50,MATCH($P$1,$H$32:$H$50,1),MATCH(Q$4,$I$31:$M$31,0)))/(INDEX($H$32:$H$50,MATCH($P$1,$H$32:$H$50,1)+1)-INDEX($H$32:$H$50,MATCH($P$1,$H$32:$H$50,1))),INDEX($I$32:$M$50,MATCH($P$1,$H$32:$H$50,0),MATCH(Q4,$I$31:$M$31,0)))","v":{"$error":"#N/A"}},{"$f":"IF(ISERROR(MATCH($P$1,$H$32:$H$50,0)),VLOOKUP($P$1,$H$32:$M$50,MATCH(R$4,$I$31:$M$31,0)+1,TRUE)+($P$1-VLOOKUP($P$1,$H$32:$H$50,1,TRUE))*(INDEX($I$32:$M$50,MATCH($P$1,$H$32:$H$50,1)+1,MATCH(R$4,$I$31:$M$31,0))-INDEX($I$32:$M$50,MATCH($P$1,$H$32:$H$50,1),MATCH(R$4,$I$31:$M$31,0)))/(INDEX($H$32:$H$50,MATCH($P$1,$H$32:$H$50,1)+1)-INDEX($H$32:$H$50,MATCH($P$1,$H$32:$H$50,1))),INDEX($I$32:$M$50,MATCH($P$1,$H$32:$H$50,0),MATCH(R4,$I$31:$M$31,0)))","v":{"$error":"#N/A"}},{"$f":"IF(ISERROR(MATCH($P$1,$H$32:$H$50,0)),VLOOKUP($P$1,$H$32:$M$50,MATCH(S$4,$I$31:$M$31,0)+1,TRUE)+($P$1-VLOOKUP($P$1,$H$32:$H$50,1,TRUE))*(INDEX($I$32:$M$50,MATCH($P$1,$H$32:$H$50,1)+1,MATCH(S$4,$I$31:$M$31,0))-INDEX($I$32:$M$50,MATCH($P$1,$H$32:$H$50,1),MATCH(S$4,$I$31:$M$31,0)))/(INDEX($H$32:$H$50,MATCH($P$1,$H$32:$H$50,1)+1)-INDEX($H$32:$H$50,MATCH($P$1,$H$32:$H$50,1))),INDEX($I$32:$M$50,MATCH($P$1,$H$32:$H$50,0),MATCH(S4,$I$31:$M$31,0)))","v":{"$error":"#N/A"}},{"$f":"IF(ISERROR(MATCH($P$1,$H$32:$H$50,0)),VLOOKUP($P$1,$H$32:$M$50,MATCH(T$4,$I$31:$M$31,0)+1,TRUE)+($P$1-VLOOKUP($P$1,$H$32:$H$50,1,TRUE))*(INDEX($I$32:$M$50,MATCH($P$1,$H$32:$H$50,1)+1,MATCH(T$4,$I$31:$M$31,0))-INDEX($I$32:$M$50,MATCH($P$1,$H$32:$H$50,1),MATCH(T$4,$I$31:$M$31,0)))/(INDEX($H$32:$H$50,MATCH($P$1,$H$32:$H$50,1)+1)-INDEX($H$32:$H$50,MATCH($P$1,$H$32:$H$50,1))),INDEX($I$32:$M$50,MATCH($P$1,$H$32:$H$50,0),MATCH(T4,$I$31:$M$31,0)))","v":{"$error":"#N/A"}}]
[0,0,0,0,0,0,null,{"$f":"A32/100","v":0},0,0,0,0,0,null,"New Separation distance",{"$f":"IF(ISERROR(MATCH($P$2,$H$32:$H$50,0)),VLOOKUP($P$2,$H$32:$M$50,MATCH(P$4,$I$31:$M$31,0)+1,TRUE)+($P$2-VLOOKUP($P$2,$H$32:$H$50,1,TRUE))*(INDEX($I$32:$M$50,MATCH($P$2,$H$32:$H$50,1)+1,MATCH(P$4,$I$31:$M$31,0))-INDEX($I$32:$M$50,MATCH($P$2,$H$32:$H$50,1),MATCH(P$4,$I$31:$M$31,0)))/(INDEX($H$32:$H$50,MATCH($P$2,$H$32:$H$50,1)+1)-INDEX($H$32:$H$50,MATCH($P$2,$H$32:$H$50,1))),INDEX($I$32:$M$50,MATCH($P$2,$H$32:$H$50,0),MATCH(P4,$I$31:$M$31,0)))","v":{"$error":"#N/A"}},{"$f":"IF(ISERROR(MATCH($P$2,$H$32:$H$50,0)),VLOOKUP($P$2,$H$32:$M$50,MATCH(Q$4,$I$31:$M$31,0)+1,TRUE)+($P$2-VLOOKUP($P$2,$H$32:$H$50,1,TRUE))*(INDEX($I$32:$M$50,MATCH($P$2,$H$32:$H$50,1)+1,MATCH(Q$4,$I$31:$M$31,0))-INDEX($I$32:$M$50,MATCH($P$2,$H$32:$H$50,1),MATCH(Q$4,$I$31:$M$31,0)))/(INDEX($H$32:$H$50,MATCH($P$2,$H$32:$H$50,1)+1)-INDEX($H$32:$H$50,MATCH($P$2,$H$32:$H$50,1))),INDEX($I$32:$M$50,MATCH($P$2,$H$32:$H$50,0),MATCH(Q4,$I$31:$M$31,0)))","v":{"$error":"#N/A"}},{"$f":"IF(ISERROR(MATCH($P$2,$H$32:$H$50,0)),VLOOKUP($P$2,$H$32:$M$50,MATCH(R$4,$I$31:$M$31,0)+1,TRUE)+($P$2-VLOOKUP($P$2,$H$32:$H$50,1,TRUE))*(INDEX($I$32:$M$50,MATCH($P$2,$H$32:$H$50,1)+1,MATCH(R$4,$I$31:$M$31,0))-INDEX($I$32:$M$50,MATCH($P$2,$H$32:$H$50,1),MATCH(R$4,$I$31:$M$31,0)))/(INDEX($H$32:$H$50,MATCH($P$2,$H$32:$H$50,1)+1)-INDEX($H$32:$H$50,MATCH($P$2,$H$32:$H$50,1))),INDEX($I$32:$M$50,MATCH($P$2,$H$32:$H$50,0),MATCH(R4,$I$31:$M$31,0)))","v":{"$error":"#N/A"}},{"$f":"IF(ISERROR(MATCH($P$2,$H$32:$H$50,0)),VLOOKUP($P$2,$H$32:$M$50,MATCH(S$4,$I$31:$M$31,0)+1,TRUE)+($P$2-VLOOKUP($P$2,$H$32:$H$50,1,TRUE))*(INDEX($I$32:$M$50,MATCH($P$2,$H$32:$H$50,1)+1,MATCH(S$4,$I$31:$M$31,0))-INDEX($I$32:$M$50,MATCH($P$2,$H$32:$H$50,1),MATCH(S$4,$I$31:$M$31,0)))/(INDEX($H$32:$H$50,MATCH($P$2,$H$32:$H$50,1)+1)-INDEX($H$32:$H$50,MATCH($P$2,$H$32:$H$50,1))),INDEX($I$32:$M$50,MATCH($P$2,$H$32:$H$50,0),MATCH(S4,$I$31:$M$31,0)))","v":{"$error":"#N/A"}},{"$f":"IF(ISERROR(MATCH($P$2,$H$32:$H$50,0)),VLOOKUP($P$2,$H$32:$M$50,MATCH(T$4,$I$31:$M$31,0)+1,TRUE)+($P$2-VLOOKUP($P$2,$H$32:$H$50,1,TRUE))*(INDEX($I$32:$M$50,MATCH($P$2,$H$32:$H$50,1)+1,MATCH(T$4,$I$31:$M$31,0))-INDEX($I$32:$M$50,MATCH($P$2,$H$32:$H$50,1),MATCH(T$4,$I$31:$M$31,0)))/(INDEX($H$32:$H$50,MATCH($P$2,$H$32:$H$50,1)+1)-INDEX($H$32:$H$50,MATCH($P$2,$H$32:$H$50,1))),INDEX($I$32:$M$50,MATCH($P$2,$H$32:$H$50,0),MATCH(T4,$I$31:$M$31,0)))","v":{"$error":"#N/A"}}]
[20,295.39999999999998,171.3,98.3,76.400000000000006,48.3,null,0.2,{"$f":"+B33/1609.347","v":0.18355270802381338},{"$f":"+C33/1609.347","v":0.10644068681272592},{"$f":"+D33/1609.347","v":6.1080674335615627E-2},{"$f":"+E33/1609.347","v":4.7472670592482544E-2},{"$f":"+F33/1609.347","v":3.0012172638964746E-2}]
[50,503.6,276,155.30000000000001,120.9,71.2,null,0.5,0.31292194908866766,0.17149812936551284,9.6498766269797628E-2,7.5123637102501833E-2,4.4241546416030855E-2]
[100,731.5,392.9,219.6,166.3,87.6,null,1,0.45453217982200234,0.2441362863322826,0.13645285945169064,0.10333383664306083,5.4432014972532333E-2]
[200,1079.0999999999999,556.6,306.5,228.2,116.7,null,2,0.67052040361711918,0.34585456088711758,0.19044991540046988,0.14179664174351461,7.251388295998315E-2]
[300,1336.6,679.1,376,264.60000000000002,118.3,null,3,0.83052318735487118,0.42197239004391224,0.23363513275881459,0.16441451097867646,7.3508075014275975E-2]
[400,1578.2,785.1,430,297.7,132.69999999999999,null,4,0.9806461875530883,0.48783761364081213,0.26718911459119754,0.18498185910185933,8.2455803502911429E-2]
[500,1747.3,866.3,475.8,331.8,146.19999999999999,null,5,1.0857198602911615,0.53829286039617308,0.29564786214532979,0.20617057725897522,9.0844298961007167E-2]
[600,1957.6,952.3,521,357.7,156.6,null,6,1.216393978427275,0.59173068331441259,0.32373378767910216,0.22226406113784036,9.7306547313910544E-2]
[700,2099.6999999999998,1015.3,555.79999999999995,363.7,170,null,7,1.3046906602491568,0.63087699545219267,0.34535746485997115,0.22599228134143848,0.10563290576861299]
[800,2241.8000000000002,1085.5999999999999,593.70000000000005,388.8,182.7,null,8,1.3929873420710388,0.67455930883768378,0.36890738914603255,0.24158866919315725,0.1135243051995623]
[900,2417.1999999999998,1140.3,624.6,406.2,187.7,null,9,1.5019756460228899,0.70854824969381991,0.38810772319456277,0.25240050778359174,0.11663115536922739]
[1000,2555.9,1198.0999999999999,655.8,422,195,null,10,1.5881596697293996,0.74446343765514833,0.4074944682532729,0.26221815431973339,0.12116715661693843]
[1500,3171.6,1466.4,779.3,458.1,200,null,15,1.9707371996219585,0.91117701775937698,0.48423366744400054,0.28464961254471538,0.12427400678660351]
[2000,3641.6,1644.9,885.5,524.6,205,null,20,2.2627811155704767,1.0220915688164207,0.55022316504768709,0.32597071980126102,0.12738085695626861]
[2500,4163.7,1823.1,957,567.20000000000005,208.4,null,25,2.5871984102869052,1.1328197088632843,0.59465112247389784,0.35244108324680756,0.12949351507164086]
[3000,4633.3999999999996,1982.6,1038.0999999999999,608.20000000000005,226,null,30,2.8790559152252433,1.2319282292756006,0.64504423222586549,0.37791725463806131,0.14042962766886197]
[3500,4910.6000000000004,2130.9,1115.2,638.29999999999995,237.4,null,35,3.051299688631476,1.3240774053078672,0.69295186184210122,0.3966204926594451,0.14751324605569838]
[4000,5263.6,2251.8000000000002,1163.5,672.1,248.8,null,40,3.2706433106098314,1.3992010424103691,0.72296403448106594,0.41762279980638112,0.15459686444253479]
[]
[]
["Lincoln, NE-AERMOD setback distances (South) as reported in the Odor Footprint Tool"]
[]
["Setback Distances (m) for Lincoln, South",null,null,null,null,null,null,"Setback Distances (mi) for Lincoln, South"]
["x 104","Annoyance Free Percentage",null,null,null,null,null,"x 106","Annoyance Free Percentage"]
["OU/s",99,98,96,94,90,null,"OU/s",99,98,96,94,90,null,"Separation distance",{"$f":"IF(ISERROR(MATCH($P$1,$H$58:$H$76,0)),VLOOKUP($P$1,$H$58:$M$76,MATCH(P$4,$I$57:$M$57,0)+1,TRUE)+($P$1-VLOOKUP($P$1,$H$58:$H$76,1,TRUE))*(INDEX($I$58:$M$76,MATCH($P$1,$H$58:$H$76,1)+1,MATCH(P$4,$I$57:$M$57,0))-INDEX($I$58:$M$76,MATCH($P$1,$H$58:$H$76,1),MATCH(P$4,$I$57:$M$57,0)))/(INDEX($H$58:$H$76,MATCH($P$1,$H$58:$H$76,1)+1)-INDEX($H$58:$H$76,MATCH($P$1,$H$58:$H$76,1))),INDEX($I$58:$M$76,MATCH($P$1,$H$58:$H$76,0),MATCH(P$4,$I$57:$M$57,0)))","v":{"$error":"#N/A"}},{"$f":"IF(ISERROR(MATCH($P$1,$H$58:$H$76,0)),VLOOKUP($P$1,$H$58:$M$76,MATCH(Q$4,$I$57:$M$57,0)+1,TRUE)+($P$1-VLOOKUP($P$1,$H$58:$H$76,1,TRUE))*(INDEX($I$58:$M$76,MATCH($P$1,$H$58:$H$76,1)+1,MATCH(Q$4,$I$57:$M$57,0))-INDEX($I$58:$M$76,MATCH($P$1,$H$58:$H$76,1),MATCH(Q$4,$I$57:$M$57,0)))/(INDEX($H$58:$H$76,MATCH($P$1,$H$58:$H$76,1)+1)-INDEX($H$58:$H$76,MATCH($P$1,$H$58:$H$76,1))),INDEX($I$58:$M$76,MATCH($P$1,$H$58:$H$76,0),MATCH(Q$4,$I$57:$M$57,0)))","v":{"$error":"#N/A"}},{"$f":"IF(ISERROR(MATCH($P$1,$H$58:$H$76,0)),VLOOKUP($P$1,$H$58:$M$76,MATCH(R$4,$I$57:$M$57,0)+1,TRUE)+($P$1-VLOOKUP($P$1,$H$58:$H$76,1,TRUE))*(INDEX($I$58:$M$76,MATCH($P$1,$H$58:$H$76,1)+1,MATCH(R$4,$I$57:$M$57,0))-INDEX($I$58:$M$76,MATCH($P$1,$H$58:$H$76,1),MATCH(R$4,$I$57:$M$57,0)))/(INDEX($H$58:$H$76,MATCH($P$1,$H$58:$H$76,1)+1)-INDEX($H$58:$H$76,MATCH($P$1,$H$58:$H$76,1))),INDEX($I$58:$M$76,MATCH($P$1,$H$58:$H$76,0),MATCH(R$4,$I$57:$M$57,0)))","v":{"$error":"#N/A"}},{"$f":"IF(ISERROR(MATCH($P$1,$H$58:$H$76,0)),VLOOKUP($P$1,$H$58:$M$76,MATCH(S$4,$I$57:$M$57,0)+1,TRUE)+($P$1-VLOOKUP($P$1,$H$58:$H$76,1,TRUE))*(INDEX($I$58:$M$76,MATCH($P$1,$H$58:$H$76,1)+1,MATCH(S$4,$I$57:$M$57,0))-INDEX($I$58:$M$76,MATCH($P$1,$H$58:$H$76,1),MATCH(S$4,$I$57:$M$57,0)))/(INDEX($H$58:$H$76,MATCH($P$1,$H$58:$H$76,1)+1)-INDEX($H$58:$H$76,MATCH($P$1,$H$58:$H$76,1))),INDEX($I$58:$M$76,MATCH($P$1,$H$58:$H$76,0),MATCH(S$4,$I$57:$M$57,0)))","v":{"$error":"#N/A"}},{"$f":"IF(ISERROR(MATCH($P$1,$H$58:$H$76,0)),VLOOKUP($P$1,$H$58:$M$76,MATCH(T$4,$I$57:$M$57,0)+1,TRUE)+($P$1-VLOOKUP($P$1,$H$58:$H$76,1,TRUE))*(INDEX($I$58:$M$76,MATCH($P$1,$H$58:$H$76,1)+1,MATCH(T$4,$I$57:$M$57,0))-INDEX($I$58:$M$76,MATCH($P$1,$H$58:$H$76,1),MATCH(T$4,$I$57:$M$57,0)))/(INDEX($H$58:$H$76,MATCH($P$1,$H$58:$H$76,1)+1)-INDEX($H$58:$H$76,MATCH($P$1,$H$58:$H$76,1))),INDEX($I$58:$M$76,MATCH($P$1,$H$58:$H$76,0),MATCH(T$4,$I$57:$M$57,0)))","v":{"$error":"#N/A"}}]
[0,0,0,0,0,0,null,{"$f":"A58/100","v":0},0,0,0,0,0,null,"New Separation distance",{"$f":"IF(ISERROR(MATCH($P$2,$H$58:$H$76,0)),VLOOKUP($P$2,$H$58:$M$76,MATCH(P$4,$I$57:$M$57,0)+1,TRUE)+($P$2-VLOOKUP($P$2,$H$58:$H$76,1,TRUE))*(INDEX($I$58:$M$76,MATCH($P$2,$H$58:$H$76,1)+1,MATCH(P$4,$I$57:$M$57,0))-INDEX($I$58:$M$76,MATCH($P$2,$H$58:$H$76,1),MATCH(P$4,$I$57:$M$57,0)))/(INDEX($H$58:$H$76,MATCH($P$2,$H$58:$H$76,1)+1)-INDEX($H$58:$H$76,MATCH($P$2,$H$58:$H$76,1))),INDEX($I$58:$M$76,MATCH($P$2,$H$58:$H$76,0),MATCH(P4,$I$57:$M$57,0)))","v":{"$error":"#N/A"}},{"$f":"IF(ISERROR(MATCH($P$2,$H$58:$H$76,0)),VLOOKUP($P$2,$H$58:$M$76,MATCH(Q$4,$I$57:$M$57,0)+1,TRUE)+($P$2-VLOOKUP($P$2,$H$58:$H$76,1,TRUE))*(INDEX($I$58:$M$76,MATCH($P$2,$H$58:$H$76,1)+1,MATCH(Q$4,$I$57:$M$57,0))-INDEX($I$58:$M$76,MATCH($P$2,$H$58:$H$76,1),MATCH(Q$4,$I$57:$M$57,0)))/(INDEX($H$58:$H$76,MATCH($P$2,$H$58:$H$76,1)+1)-INDEX($H$58:$H$76,MATCH($P$2,$H$58:$H$76,1))),INDEX($I$58:$M$76,MATCH($P$2,$H$58:$H$76,0),MATCH(Q4,$I$57:$M$57,0)))","v":{"$error":"#N/A"}},{"$f":"IF(ISERROR(MATCH($P$2,$H$58:$H$76,0)),VLOOKUP($P$2,$H$58:$M$76,MATCH(R$4,$I$57:$M$57,0)+1,TRUE)+($P$2-VLOOKUP($P$2,$H$58:$H$76,1,TRUE))*(INDEX($I$58:$M$76,MATCH($P$2,$H$58:$H$76,1)+1,MATCH(R$4,$I$57:$M$57,0))-INDEX($I$58:$M$76,MATCH($P$2,$H$58:$H$76,1),MATCH(R$4,$I$57:$M$57,0)))/(INDEX($H$58:$H$76,MATCH($P$2,$H$58:$H$76,1)+1)-INDEX($H$58:$H$76,MATCH($P$2,$H$58:$H$76,1))),INDEX($I$58:$M$76,MATCH($P$2,$H$58:$H$76,0),MATCH(R4,$I$57:$M$57,0)))","v":{"$error":"#N/A"}},{"$f":"IF(ISERROR(MATCH($P$2,$H$58:$H$76,0)),VLOOKUP($P$2,$H$58:$M$76,MATCH(S$4,$I$57:$M$57,0)+1,TRUE)+($P$2-VLOOKUP($P$2,$H$58:$H$76,1,TRUE))*(INDEX($I$58:$M$76,MATCH($P$2,$H$58:$H$76,1)+1,MATCH(S$4,$I$57:$M$57,0))-INDEX($I$58:$M$76,MATCH($P$2,$H$58:$H$76,1),MATCH(S$4,$I$57:$M$57,0)))/(INDEX($H$58:$H$76,MATCH($P$2,$H$58:$H$76,1)+1)-INDEX($H$58:$H$76,MATCH($P$2,$H$58:$H$76,1))),INDEX($I$58:$M$76,MATCH($P$2,$H$58:$H$76,0),MATCH(S4,$I$57:$M$57,0)))","v":{"$error":"#N/A"}},{"$f":"IF(ISERROR(MATCH($P$2,$H$58:$H$76,0)),VLOOKUP($P$2,$H$58:$M$76,MATCH(T$4,$I$57:$M$57,0)+1,TRUE)+($P$2-VLOOKUP($P$2,$H$58:$H$76,1,TRUE))*(INDEX($I$58:$M$76,MATCH($P$2,$H$58:$H$76,1)+1,MATCH(T$4,$I$57:$M$57,0))-INDEX($I$58:$M$76,MATCH($P$2,$H$58:$H$76,1),MATCH(T$4,$I$57:$M$57,0)))/(INDEX($H$58:$H$76,MATCH($P$2,$H$58:$H$76,1)+1)-INDEX($H$58:$H$76,MATCH($P$2,$H$58:$H$76,1))),INDEX($I$58:$M$76,MATCH($P$2,$H$58:$H$76,0),MATCH(T4,$I$57:$M$57,0)))","v":{"$error":"#N/A"}}]
[20,282.8,165.1,96.7,79.8,58.7,null,0.2,{"$f":"+B59/1609.347","v":0.17572344559625738},{"$f":"+C59/1609.347","v":0.1025881926023412},{"$f":"+D59/1609.347","v":6.0086482281322802E-2},{"$f":"+E59/1609.347","v":4.9585328707854801E-2},{"$f":"+F59/1609.347","v":3.647442099186813E-2}]
[50,481.2,272.3,153.4,127.6,88.6,null,0.5,0.29900326032856805,0.1691990602399607,9.5318163205324893E-2,7.9286816329853044E-2,5.5053385006465352E-2]
[100,697.4,387,218.2,179.9,117.7,null,1,0.43334346166488641,0.24047020313207779,0.13558294140418442,0.11178446910454987,7.3135252993916169E-2]
[200,1001,552.1,309.2,250.5,153.9,null,2,0.62199140396695063,0.34305839573441899,0.19212761449208901,0.15565319350022089,9.562884822229141E-2]
[300,1256.0999999999999,674.7,379.1,302.60000000000002,177.2,null,3,0.78050289962326325,0.419238361894607,0.23556137986400696,0.18802657226813113,0.1101067700129307]
[400,1471.8,777.5,436.4,344.7,197,null,4,0.91453241594261525,0.48311520138292113,0.27116588280836884,0.21418625069671116,0.12240989668480445]
[500,1680.8,845.7,487.8,380.5,214.4,null,5,1.0443987530346159,0.52549263769715293,0.30310430255252596,0.23643129791151318,0.13322173527523898]
[600,1837.9,931.5,532.9,412.3,228.3,null,6,1.142015985365493,0.57880618660860583,0.33112809108290503,0.25619086499058313,0.14185877874690792]
[700,1988,1011.4,575.6,437.4,237,null,7,1.235283627458839,0.62845365231985395,0.35766059153184493,0.27178725284230187,0.14726469804212516]
[800,2160.6999999999998,1061.5999999999999,613.4,463.3,248.1,null,8,1.3425942323190709,0.65964642802329143,0.38114837881451297,0.28788073672116704,0.15416190541878166]
[900,2281.8000000000002,1141.0999999999999,649,482.7,258.39999999999998,null,9,1.4178421434283597,0.70904534572096634,0.40326915202252839,0.29993531537946755,0.16056201676829171]
[1000,2445.8000000000002,1174.3,686.6,506.2,267.7,null,10,1.5197468289933744,0.72967483084754248,0.42663266529840987,0.31453751117689349,0.16634075808386881]
[1500,2990.2,1414,832.2,600.70000000000005,302.89999999999998,null,15,1.858020675466509,0.87861722798128683,0.51710414223905721,0.37325697938356367,0.18821298327831101]
[2000,3522.8,1611.1,944.9,670.1,331.2,null,20,2.1889623555392346,1.0010892616694846,0.58713254506330825,0.41638005973851511,0.2057977552386154]
[2500,3963.2,1782.8,1053.2,720.8,351.7,null,25,2.4626137184833352,1.1077784964957837,0.65442691973825418,0.44788352045891905,0.21853584093424228]
[3000,4373.7,1937,1146.9000000000001,780.3,369.6,null,30,2.7176861174128386,1.203593755728255,0.71264929191777793,0.48485503747793357,0.22965836454164332]
[3500,4811.3,2057.3000000000002,1217.7,821.6,385.7,null,35,2.9895976442619276,1.2783445708103971,0.75664229032023556,0.51051761987936728,0.23966242208796487]
[4000,5088.5,2184.4,1295.5,862.4,397.8,null,40,3.16184141766816,1.3573207021232836,0.8049848789602243,0.53586951726383436,0.2471809994985544]
[]
[]
["Lincoln, NE-AERMOD setback distances (West) as reported in the Odor Footprint Tool"]
[]
["Setback Distances (m) for Lincoln, West",null,null,null,null,null,null,"Setback Distances (m) for Lincoln, West"]
["x 104","Annoyance Free Percentage",null,null,null,null,null,"x 106","Annoyance Free Percentage"]
["OU/s",99,98,96,94,90,null,"OU/s",99,98,96,94,90,null,"Separation distance",{"$f":"IF(ISERROR(MATCH($P$1,$H$84:$H$102,0)),VLOOKUP($P$1,$H$84:$M$102,MATCH(P$4,$I$83:$M$83,0)+1,TRUE)+($P$1-VLOOKUP($P$1,$H$84:$H$102,1,TRUE))*(INDEX($I$84:$M$102,MATCH($P$1,$H$84:$H$102,1)+1,MATCH(P$4,$I$83:$M$83,0))-INDEX($I$84:$M$102,MATCH($P$1,$H$84:$H$102,1),MATCH(P$4,$I$83:$M$83,0)))/(INDEX($H$84:$H$102,MATCH($P$1,$H$84:$H$102,1)+1)-INDEX($H$84:$H$102,MATCH($P$1,$H$84:$H$102,1))),INDEX($I$84:$M$102,MATCH($P$1,$H$84:$H$102,0),MATCH(P4,$I$83:$M$83,0)))","v":{"$error":"#N/A"}},{"$f":"IF(ISERROR(MATCH($P$1,$H$84:$H$102,0)),VLOOKUP($P$1,$H$84:$M$102,MATCH(Q$4,$I$83:$M$83,0)+1,TRUE)+($P$1-VLOOKUP($P$1,$H$84:$H$102,1,TRUE))*(INDEX($I$84:$M$102,MATCH($P$1,$H$84:$H$102,1)+1,MATCH(Q$4,$I$83:$M$83,0))-INDEX($I$84:$M$102,MATCH($P$1,$H$84:$H$102,1),MATCH(Q$4,$I$83:$M$83,0)))/(INDEX($H$84:$H$102,MATCH($P$1,$H$84:$H$102,1)+1)-INDEX($H$84:$H$102,MATCH($P$1,$H$84:$H$102,1))),INDEX($I$84:$M$102,MATCH($P$1,$H$84:$H$102,0),MATCH(Q4,$I$83:$M$83,0)))","v":{"$error":"#N/A"}},{"$f":"IF(ISERROR(MATCH($P$1,$H$84:$H$102,0)),VLOOKUP($P$1,$H$84:$M$102,MATCH(R$4,$I$83:$M$83,0)+1,TRUE)+($P$1-VLOOKUP($P$1,$H$84:$H$102,1,TRUE))*(INDEX($I$84:$M$102,MATCH($P$1,$H$84:$H$102,1)+1,MATCH(R$4,$I$83:$M$83,0))-INDEX($I$84:$M$102,MATCH($P$1,$H$84:$H$102,1),MATCH(R$4,$I$83:$M$83,0)))/(INDEX($H$84:$H$102,MATCH($P$1,$H$84:$H$102,1)+1)-INDEX($H$84:$H$102,MATCH($P$1,$H$84:$H$102,1))),INDEX($I$84:$M$102,MATCH($P$1,$H$84:$H$102,0),MATCH(R4,$I$83:$M$83,0)))","v":{"$error":"#N/A"}},{"$f":"IF(ISERROR(MATCH($P$1,$H$84:$H$102,0)),VLOOKUP($P$1,$H$84:$M$102,MATCH(S$4,$I$83:$M$83,0)+1,TRUE)+($P$1-VLOOKUP($P$1,$H$84:$H$102,1,TRUE))*(INDEX($I$84:$M$102,MATCH($P$1,$H$84:$H$102,1)+1,MATCH(S$4,$I$83:$M$83,0))-INDEX($I$84:$M$102,MATCH($P$1,$H$84:$H$102,1),MATCH(S$4,$I$83:$M$83,0)))/(INDEX($H$84:$H$102,MATCH($P$1,$H$84:$H$102,1)+1)-INDEX($H$84:$H$102,MATCH($P$1,$H$84:$H$102,1))),INDEX($I$84:$M$102,MATCH($P$1,$H$84:$H$102,0),MATCH(S4,$I$83:$M$83,0)))","v":{"$error":"#N/A"}},{"$f":"IF(ISERROR(MATCH($P$1,$H$84:$H$102,0)),VLOOKUP($P$1,$H$84:$M$102,MATCH(T$4,$I$83:$M$83,0)+1,TRUE)+($P$1-VLOOKUP($P$1,$H$84:$H$102,1,TRUE))*(INDEX($I$84:$M$102,MATCH($P$1,$H$84:$H$102,1)+1,MATCH(T$4,$I$83:$M$83,0))-INDEX($I$84:$M$102,MATCH($P$1,$H$84:$H$102,1),MATCH(T$4,$I$83:$M$83,0)))/(INDEX($H$84:$H$102,MATCH($P$1,$H$84:$H$102,1)+1)-INDEX($H$84:$H$102,MATCH($P$1,$H$84:$H$102,1))),INDEX($I$84:$M$102,MATCH($P$1,$H$84:$H$102,0),MATCH(T4,$I$83:$M$83,0)))","v":{"$error":"#N/A"}}]
[0,0,0,0,0,0,null,{"$f":"A84/100","v":0},0,0,0,0,0,null,"New Separation distance",{"$f":"IF(ISERROR(MATCH($P$2,$H$84:$H$102,0)),VLOOKUP($P$2,$H$84:$M$102,MATCH(P$4,$I$83:$M$83,0)+1,TRUE)+($P$2-VLOOKUP($P$2,$H$84:$H$102,1,TRUE))*(INDEX($I$84:$M$102,MATCH($P$2,$H$84:$H$102,1)+1,MATCH(P$4,$I$83:$M$83,0))-INDEX($I$84:$M$102,MATCH($P$2,$H$84:$H$102,1),MATCH(P$4,$I$83:$M$83,0)))/(INDEX($H$84:$H$102,MATCH($P$2,$H$84:$H$102,1)+1)-INDEX($H$84:$H$102,MATCH($P$2,$H$84:$H$102,1))),INDEX($I$84:$M$102,MATCH($P$2,$H$84:$H$102,0),MATCH(P4,$I$83:$M$83,0)))","v":{"$error":"#N/A"}},{"$f":"IF(ISERROR(MATCH($P$2,$H$84:$H$102,0)),VLOOKUP($P$2,$H$84:$M$102,MATCH(Q$4,$I$83:$M$83,0)+1,TRUE)+($P$2-VLOOKUP($P$2,$H$84:$H$102,1,TRUE))*(INDEX($I$84:$M$102,MATCH($P$2,$H$84:$H$102,1)+1,MATCH(Q$4,$I$83:$M$83,0))-INDEX($I$84:$M$102,MATCH($P$2,$H$84:$H$102,1),MATCH(Q$4,$I$83:$M$83,0)))/(INDEX($H$84:$H$102,MATCH($P$2,$H$84:$H$102,1)+1)-INDEX($H$84:$H$102,MATCH($P$2,$H$84:$H$102,1))),INDEX($I$84:$M$102,MATCH($P$2,$H$84:$H$102,0),MATCH(Q4,$I$83:$M$83,0)))","v":{"$error":"#N/A"}},{"$f":"IF(ISERROR(MATCH($P$2,$H$84:$H$102,0)),VLOOKUP($P$2,$H$84:$M$102,MATCH(R$4,$I$83:$M$83,0)+1,TRUE)+($P$2-VLOOKUP($P$2,$H$84:$H$102,1,TRUE))*(INDEX($I$84:$M$102,MATCH($P$2,$H$84:$H$102,1)+1,MATCH(R$4,$I$83:$M$83,0))-INDEX($I$84:$M$102,MATCH($P$2,$H$84:$H$102,1),MATCH(R$4,$I$83:$M$83,0)))/(INDEX($H$84:$H$102,MATCH($P$2,$H$84:$H$102,1)+1)-INDEX($H$84:$H$102,MATCH($P$2,$H$84:$H$102,1))),INDEX($I$84:$M$102,MATCH($P$2,$H$84:$H$102,0),MATCH(R4,$I$83:$M$83,0)))","v":{"$error":"#N/A"}},{"$f":"IF(ISERROR(MATCH($P$2,$H$84:$H$102,0)),VLOOKUP($P$2,$H$84:$M$102,MATCH(S$4,$I$83:$M$83,0)+1,TRUE)+($P$2-VLOOKUP($P$2,$H$84:$H$102,1,TRUE))*(INDEX($I$84:$M$102,MATCH($P$2,$H$84:$H$102,1)+1,MATCH(S$4,$I$83:$M$83,0))-INDEX($I$84:$M$102,MATCH($P$2,$H$84:$H$102,1),MATCH(S$4,$I$83:$M$83,0)))/(INDEX($H$84:$H$102,MATCH($P$2,$H$84:$H$102,1)+1)-INDEX($H$84:$H$102,MATCH($P$2,$H$84:$H$102,1))),INDEX($I$84:$M$102,MATCH($P$2,$H$84:$H$102,0),MATCH(S4,$I$83:$M$83,0)))","v":{"$error":"#N/A"}},{"$f":"IF(ISERROR(MATCH($P$2,$H$84:$H$102,0)),VLOOKUP($P$2,$H$84:$M$102,MATCH(T$4,$I$83:$M$83,0)+1,TRUE)+($P$2-VLOOKUP($P$2,$H$84:$H$102,1,TRUE))*(INDEX($I$84:$M$102,MATCH($P$2,$H$84:$H$102,1)+1,MATCH(T$4,$I$83:$M$83,0))-INDEX($I$84:$M$102,MATCH($P$2,$H$84:$H$102,1),MATCH(T$4,$I$83:$M$83,0)))/(INDEX($H$84:$H$102,MATCH($P$2,$H$84:$H$102,1)+1)-INDEX($H$84:$H$102,MATCH($P$2,$H$84:$H$102,1))),INDEX($I$84:$M$102,MATCH($P$2,$H$84:$H$102,0),MATCH(T4,$I$83:$M$83,0)))","v":{"$error":"#N/A"}}]
[20,334.6,202.7,128.1,103.4,75,null,0.2,{"$f":"+B85/1609.347","v":0.20791041335398769},{"$f":"+C85/1609.347","v":0.12595170587822266},{"$f":"+D85/1609.347","v":7.9597501346819546E-2},{"$f":"+E85/1609.347","v":6.4249661508674019E-2},{"$f":"+F85/1609.347","v":4.6602752544976318E-2}]
[50,574.29999999999995,334.5,207.7,162.1,121.4,null,0.5,0.35685281048773193,0.20784827635059439,0.12905855604788774,0.10072408250054214,7.5434322119468336E-2]
[100,857.1,489.6,295.5,235.8,162.80000000000001,null,1,0.5325762560839894,0.30422276861360542,0.18361484502720668,0.14651905400140555,0.10115904152429527]
[200,1282.0999999999999,705.5,424,333.2,226.3,null,2,0.79665852050552177,0.43837655893974387,0.26346089438759945,0.20704049530648144,0.14061603867904188]
[300,1619.9,879.2,512,399.6,258.3,null,3,1.0065573179680951,0.54630853383390909,0.31814145737370497,0.24829946555963384,0.16049987976489843]
[400,1920.4,1019.6,595.70000000000005,464.3,295.89999999999998,null,4,1.1932790131649669,0.63354888659810471,0.37015012921389862,0.28850210675510007,0.18386339304077989]
[500,2157.5,1136.2,671,522.29999999999995,332,null,5,1.3406058482104855,0.70600063255469458,0.41693929276905478,0.32454156872321505,0.20629485126576183]
[600,2429.1999999999998,1278.0999999999999,737.8,568.1,357.9,null,6,1.5094320864300861,0.79417304036978964,0.45844681103578033,0.35300031627734729,0.22238833514462697]
[700,2624.8,1377.7,780.6,596.79999999999995,354.5,null,7,1.6309720650673847,0.85606149574951829,0.48504144848811354,0.37083363625122484,0.22027567702925471]
[800,2819.1,1489.8,846.4,646.79999999999995,380.3,null,8,1.7517042626605697,0.92571707655340951,0.52592759672090605,0.40190213794787571,0.23630702390472658]
[900,2997.1,1582.1,906.1,669.7,422.8,null,9,1.8623081287006469,0.98306953068542702,0.56302338774670724,0.41613151172494189,0.26271525034687981]
[1000,3175.7,1664.8,936.6,712,417.8,null,10,1.9732848167610837,1.0344568324916876,0.5819751737816643,0.44241546416030852,0.25960840017721476]
[1500,3998,2104.8000000000002,1159.7,822.6,490,null,15,2.4842373956642043,1.3078596474222155,0.72060282835212053,0.51113898991330031,0.30447131662717858]
[2000,4687.7,2410.3000000000002,1315.1,950.6,520,null,20,2.9127963080678061,1.4976881927887524,0.81716373162531131,0.59067435425672654,0.32311241764516913]
[2500,5222.6000000000004,2695.4,1433.8,1059.5999999999999,555,null,25,3.2451671392185779,1.6748407894630555,0.89092035465316055,0.65840368795542537,0.34486036883282473]
[3000,5804.7,2948.9,1562.1,1157.8,599.1,null,30,3.6068666359709871,1.8323580930650756,0.97064213000676669,0.71942222528764765,0.37226278732927082]
[3500,6284.3,3225.3,1694.4,1232.5999999999999,636.4,null,35,3.9048757042452622,2.0041047704441617,1.052849385496105,0.76590070382583741,0.39543988959497234]
[4000,6780.5,3466.7,1789.6,1301.8,670,null,40,4.2131995150828256,2.1541034966355919,1.1120038127265282,0.80889951017400219,0.41631792273512175]

{"sheet":"Base Setback","index":13,"n_rows":43,"n_cols":8,"rows_kept":43,"cut":false,"hidden":true,"merged":[]}
["North/Northeast"]
["Annoyance free percentage",0.99,0.98,0.96,0.94,0.9,null,{"$f":"INDEX(B3:F9,MATCH(Inputs!E10,'Base Setback'!A3:A9,0),MATCH(Inputs!D51,'Base Setback'!B2:F2,0))","v":{"$error":"#N/A"}}]
["Grand Island, Neb. (South-central Neb.)",{"$f":"'Grand Island'!P5","v":{"$error":"#N/A"}},{"$f":"'Grand Island'!Q5","v":{"$error":"#N/A"}},{"$f":"'Grand Island'!R5","v":{"$error":"#N/A"}},{"$f":"'Grand Island'!S5","v":{"$error":"#N/A"}},{"$f":"'Grand Island'!T5","v":{"$error":"#N/A"}}]
["Lincoln, Neb. (Airport salt flats)",{"$f":"Lincoln!P5","v":{"$error":"#N/A"}},{"$f":"Lincoln!Q5","v":{"$error":"#N/A"}},{"$f":"Lincoln!R5","v":{"$error":"#N/A"}},{"$f":"Lincoln!S5","v":{"$error":"#N/A"}},{"$f":"Lincoln!T5","v":{"$error":"#N/A"}}]
["Norfolk, Neb. (Northeast Neb.)",{"$f":"Norfolk!P5","v":{"$error":"#N/A"}},{"$f":"Norfolk!Q5","v":{"$error":"#N/A"}},{"$f":"Norfolk!R5","v":{"$error":"#N/A"}},{"$f":"Norfolk!S5","v":{"$error":"#N/A"}},{"$f":"Norfolk!T5","v":{"$error":"#N/A"}}]
["North Platte, Neb. (Southwest Neb.)",{"$f":"'North Platte'!P5","v":{"$error":"#N/A"}},{"$f":"'North Platte'!Q5","v":{"$error":"#N/A"}},{"$f":"'North Platte'!R5","v":{"$error":"#N/A"}},{"$f":"'North Platte'!S5","v":{"$error":"#N/A"}},{"$f":"'North Platte'!T5","v":{"$error":"#N/A"}}]
["Alliance, Neb. (Neb. Panhandle)",{"$f":"Alliance!P5","v":{"$error":"#N/A"}},{"$f":"Alliance!Q5","v":{"$error":"#N/A"}},{"$f":"Alliance!R5","v":{"$error":"#N/A"}},{"$f":"Alliance!S5","v":{"$error":"#N/A"}},{"$f":"Alliance!T5","v":{"$error":"#N/A"}}]
["Ainsworth, Neb. (North-central Neb.)",{"$f":"Ainsworth!P5","v":{"$error":"#N/A"}},{"$f":"Ainsworth!Q5","v":{"$error":"#N/A"}},{"$f":"Ainsworth!R5","v":{"$error":"#N/A"}},{"$f":"Ainsworth!S5","v":{"$error":"#N/A"}},{"$f":"Ainsworth!T5","v":{"$error":"#N/A"}}]
["Scottsbluff, Neb. (N. Platte River Valley)",{"$f":"Scottsbluff!P5","v":{"$error":"#N/A"}},{"$f":"Scottsbluff!Q5","v":{"$error":"#N/A"}},{"$f":"Scottsbluff!R5","v":{"$error":"#N/A"}},{"$f":"Scottsbluff!S5","v":{"$error":"#N/A"}},{"$f":"Scottsbluff!T5","v":{"$error":"#N/A"}}]
["Beatrice, Neb. (Southeast Neb.)",{"$f":"Beatrice!P5","v":{"$error":"#N/A"}},{"$f":"Beatrice!Q5","v":{"$error":"#N/A"}},{"$f":"Beatrice!R5","v":{"$error":"#N/A"}},{"$f":"Beatrice!S5","v":{"$error":"#N/A"}},{"$f":"Beatrice!T5","v":{"$error":"#N/A"}}]
[]
["East/Southeast"]
["Annoyance free percentage",0.99,0.98,0.96,0.94,0.9]
["Grand Island, Neb. (South-central Neb.)",{"$f":"'Grand Island'!P31","v":{"$error":"#N/A"}},{"$f":"'Grand Island'!Q31","v":{"$error":"#N/A"}},{"$f":"'Grand Island'!R31","v":{"$error":"#N/A"}},{"$f":"'Grand Island'!S31","v":{"$error":"#N/A"}},{"$f":"'Grand Island'!T31","v":{"$error":"#N/A"}}]
["Lincoln, Neb. (Airport salt flats)",{"$f":"Lincoln!P31","v":{"$error":"#N/A"}},{"$f":"Lincoln!Q31","v":{"$error":"#N/A"}},{"$f":"Lincoln!R31","v":{"$error":"#N/A"}},{"$f":"Lincoln!S31","v":{"$error":"#N/A"}},{"$f":"Lincoln!T31","v":{"$error":"#N/A"}}]
["Norfolk, Neb. (Northeast Neb.)",{"$f":"Norfolk!P31","v":{"$error":"#N/A"}},{"$f":"Norfolk!Q31","v":{"$error":"#N/A"}},{"$f":"Norfolk!R31","v":{"$error":"#N/A"}},{"$f":"Norfolk!S31","v":{"$error":"#N/A"}},{"$f":"Norfolk!T31","v":{"$error":"#N/A"}}]
["North Platte, Neb. (Southwest Neb.)",{"$f":"'North Platte'!P31","v":{"$error":"#N/A"}},{"$f":"'North Platte'!Q31","v":{"$error":"#N/A"}},{"$f":"'North Platte'!R31","v":{"$error":"#N/A"}},{"$f":"'North Platte'!S31","v":{"$error":"#N/A"}},{"$f":"'North Platte'!T31","v":{"$error":"#N/A"}}]
["Alliance, Neb. (Neb. Panhandle)",{"$f":"Alliance!P31","v":{"$error":"#N/A"}},{"$f":"Alliance!Q31","v":{"$error":"#N/A"}},{"$f":"Alliance!R31","v":{"$error":"#N/A"}},{"$f":"Alliance!S31","v":{"$error":"#N/A"}},{"$f":"Alliance!T31","v":{"$error":"#N/A"}}]
["Ainsworth, Neb. (North-central Neb.)",{"$f":"Ainsworth!P30","v":{"$error":"#N/A"}},{"$f":"Ainsworth!Q30","v":{"$error":"#N/A"}},{"$f":"Ainsworth!R30","v":{"$error":"#N/A"}},{"$f":"Ainsworth!S30","v":{"$error":"#N/A"}},{"$f":"Ainsworth!T30","v":{"$error":"#N/A"}}]
["Scottsbluff, Neb. (N. Platte River Valley)",{"$f":"Scottsbluff!P31","v":{"$error":"#N/A"}},{"$f":"Scottsbluff!Q31","v":{"$error":"#N/A"}},{"$f":"Scottsbluff!R31","v":{"$error":"#N/A"}},{"$f":"Scottsbluff!S31","v":{"$error":"#N/A"}},{"$f":"Scottsbluff!T31","v":{"$error":"#N/A"}}]
["Beatrice, Neb. (Southeast Neb.)",{"$f":"Beatrice!P31","v":{"$error":"#N/A"}},{"$f":"Beatrice!Q31","v":{"$error":"#N/A"}},{"$f":"Beatrice!R31","v":{"$error":"#N/A"}},{"$f":"Beatrice!S31","v":{"$error":"#N/A"}},{"$f":"Beatrice!T31","v":{"$error":"#N/A"}}]
[]
["South/Southwest"]
["Annoyance free percentage",0.99,0.98,0.96,0.94,0.9]
["Grand Island, Neb. (South-central Neb.)",{"$f":"'Grand Island'!P57","v":{"$error":"#N/A"}},{"$f":"'Grand Island'!Q57","v":{"$error":"#N/A"}},{"$f":"'Grand Island'!R57","v":{"$error":"#N/A"}},{"$f":"'Grand Island'!S57","v":{"$error":"#N/A"}},{"$f":"'Grand Island'!T57","v":{"$error":"#N/A"}}]
["Lincoln, Neb. (Airport salt flats)",{"$f":"Lincoln!P57","v":{"$error":"#N/A"}},{"$f":"Lincoln!Q57","v":{"$error":"#N/A"}},{"$f":"Lincoln!R57","v":{"$error":"#N/A"}},{"$f":"Lincoln!S57","v":{"$error":"#N/A"}},{"$f":"Lincoln!T57","v":{"$error":"#N/A"}}]
["Norfolk, Neb. (Northeast Neb.)",{"$f":"Norfolk!P57","v":{"$error":"#N/A"}},{"$f":"Norfolk!Q57","v":{"$error":"#N/A"}},{"$f":"Norfolk!R57","v":{"$error":"#N/A"}},{"$f":"Norfolk!S57","v":{"$error":"#N/A"}},{"$f":"Norfolk!T57","v":{"$error":"#N/A"}}]
["North Platte, Neb. (Southwest Neb.)",{"$f":"'North Platte'!P57","v":{"$error":"#N/A"}},{"$f":"'North Platte'!Q57","v":{"$error":"#N/A"}},{"$f":"'North Platte'!R57","v":{"$error":"#N/A"}},{"$f":"'North Platte'!S57","v":{"$error":"#N/A"}},{"$f":"'North Platte'!T57","v":{"$error":"#N/A"}}]
["Alliance, Neb. (Neb. Panhandle)",{"$f":"Alliance!P57","v":{"$error":"#N/A"}},{"$f":"Alliance!Q57","v":{"$error":"#N/A"}},{"$f":"Alliance!R57","v":{"$error":"#N/A"}},{"$f":"Alliance!S57","v":{"$error":"#N/A"}},{"$f":"Alliance!T57","v":{"$error":"#N/A"}}]
["Ainsworth, Neb. (North-central Neb.)",{"$f":"Ainsworth!P55","v":{"$error":"#N/A"}},{"$f":"Ainsworth!Q55","v":{"$error":"#N/A"}},{"$f":"Ainsworth!R55","v":{"$error":"#N/A"}},{"$f":"Ainsworth!S55","v":{"$error":"#N/A"}},{"$f":"Ainsworth!T55","v":{"$error":"#N/A"}}]
["Scottsbluff, Neb. (N. Platte River Valley)",{"$f":"Scottsbluff!P57","v":{"$error":"#N/A"}},{"$f":"Scottsbluff!Q57","v":{"$error":"#N/A"}},{"$f":"Scottsbluff!R57","v":{"$error":"#N/A"}},{"$f":"Scottsbluff!S57","v":{"$error":"#N/A"}},{"$f":"Scottsbluff!T57","v":{"$error":"#N/A"}}]
["Beatrice, Neb. (Southeast Neb.)",{"$f":"Beatrice!P57","v":{"$error":"#N/A"}},{"$f":"Beatrice!Q57","v":{"$error":"#N/A"}},{"$f":"Beatrice!R57","v":{"$error":"#N/A"}},{"$f":"Beatrice!S57","v":{"$error":"#N/A"}},{"$f":"Beatrice!T57","v":{"$error":"#N/A"}}]
[]
["West/Northwest"]
["Annoyance free percentage",0.99,0.98,0.96,0.94,0.9]
["Grand Island, Neb. (South-central Neb.)",{"$f":"'Grand Island'!P83","v":{"$error":"#N/A"}},{"$f":"'Grand Island'!Q83","v":{"$error":"#N/A"}},{"$f":"'Grand Island'!R83","v":{"$error":"#N/A"}},{"$f":"'Grand Island'!S83","v":{"$error":"#N/A"}},{"$f":"'Grand Island'!T83","v":{"$error":"#N/A"}}]
["Lincoln, Neb. (Airport salt flats)",{"$f":"Lincoln!P83","v":{"$error":"#N/A"}},{"$f":"Lincoln!Q83","v":{"$error":"#N/A"}},{"$f":"Lincoln!R83","v":{"$error":"#N/A"}},{"$f":"Lincoln!S83","v":{"$error":"#N/A"}},{"$f":"Lincoln!T83","v":{"$error":"#N/A"}}]
["Norfolk, Neb. (Northeast Neb.)",{"$f":"Norfolk!P83","v":{"$error":"#N/A"}},{"$f":"Norfolk!Q83","v":{"$error":"#N/A"}},{"$f":"Norfolk!R83","v":{"$error":"#N/A"}},{"$f":"Norfolk!S83","v":{"$error":"#N/A"}},{"$f":"Norfolk!T83","v":{"$error":"#N/A"}}]
["North Platte, Neb. (Southwest Neb.)",{"$f":"'North Platte'!P83","v":{"$error":"#N/A"}},{"$f":"'North Platte'!Q83","v":{"$error":"#N/A"}},{"$f":"'North Platte'!R83","v":{"$error":"#N/A"}},{"$f":"'North Platte'!S83","v":{"$error":"#N/A"}},{"$f":"'North Platte'!T83","v":{"$error":"#N/A"}}]
["Alliance, Neb. (Neb. Panhandle)",{"$f":"Alliance!P83","v":{"$error":"#N/A"}},{"$f":"Alliance!Q83","v":{"$error":"#N/A"}},{"$f":"Alliance!R83","v":{"$error":"#N/A"}},{"$f":"Alliance!S83","v":{"$error":"#N/A"}},{"$f":"Alliance!T83","v":{"$error":"#N/A"}}]
["Ainsworth, Neb. (North-central Neb.)",{"$f":"Ainsworth!P80","v":{"$error":"#N/A"}},{"$f":"Ainsworth!Q80","v":{"$error":"#N/A"}},{"$f":"Ainsworth!R80","v":{"$error":"#N/A"}},{"$f":"Ainsworth!S80","v":{"$error":"#N/A"}},{"$f":"Ainsworth!T80","v":{"$error":"#N/A"}}]
["Scottsbluff, Neb. (N. Platte River Valley)",{"$f":"Scottsbluff!P83","v":{"$error":"#N/A"}},{"$f":"Scottsbluff!Q83","v":{"$error":"#N/A"}},{"$f":"Scottsbluff!R83","v":{"$error":"#N/A"}},{"$f":"Scottsbluff!S83","v":{"$error":"#N/A"}},{"$f":"Scottsbluff!T83","v":{"$error":"#N/A"}}]
["Beatrice, Neb. (Southeast Neb.)",{"$f":"Beatrice!P83","v":{"$error":"#N/A"}},{"$f":"Beatrice!Q83","v":{"$error":"#N/A"}},{"$f":"Beatrice!R83","v":{"$error":"#N/A"}},{"$f":"Beatrice!S83","v":{"$error":"#N/A"}},{"$f":"Beatrice!T83","v":{"$error":"#N/A"}}]

{"sheet":"Alt setback","index":14,"n_rows":43,"n_cols":6,"rows_kept":43,"cut":false,"hidden":true,"merged":[]}
["North/Northeast"]
["Annoyance free percentage",0.99,0.98,0.96,0.94,0.9]
["Grand Island, Neb. (South-central Neb.)",{"$f":"'Grand Island'!P6","v":{"$error":"#N/A"}},{"$f":"'Grand Island'!Q6","v":{"$error":"#N/A"}},{"$f":"'Grand Island'!R6","v":{"$error":"#N/A"}},{"$f":"'Grand Island'!S6","v":{"$error":"#N/A"}},{"$f":"'Grand Island'!T6","v":{"$error":"#N/A"}}]
["Lincoln, Neb. (Airport salt flats)",{"$f":"Lincoln!P6","v":{"$error":"#N/A"}},{"$f":"Lincoln!Q6","v":{"$error":"#N/A"}},{"$f":"Lincoln!R6","v":{"$error":"#N/A"}},{"$f":"Lincoln!S6","v":{"$error":"#N/A"}},{"$f":"Lincoln!T6","v":{"$error":"#N/A"}}]
["Norfolk, Neb. (Northeast Neb.)",{"$f":"Norfolk!P6","v":{"$error":"#N/A"}},{"$f":"Norfolk!Q6","v":{"$error":"#N/A"}},{"$f":"Norfolk!R6","v":{"$error":"#N/A"}},{"$f":"Norfolk!S6","v":{"$error":"#N/A"}},{"$f":"Norfolk!T6","v":{"$error":"#N/A"}}]
["North Platte, Neb. (Southwest Neb.)",{"$f":"'North Platte'!P6","v":{"$error":"#N/A"}},{"$f":"'North Platte'!Q6","v":{"$error":"#N/A"}},{"$f":"'North Platte'!R6","v":{"$error":"#N/A"}},{"$f":"'North Platte'!S6","v":{"$error":"#N/A"}},{"$f":"'North Platte'!T6","v":{"$error":"#N/A"}}]
["Alliance, Neb. (Neb. Panhandle)",{"$f":"Alliance!P6","v":{"$error":"#N/A"}},{"$f":"Alliance!Q6","v":{"$error":"#N/A"}},{"$f":"Alliance!R6","v":{"$error":"#N/A"}},{"$f":"Alliance!S6","v":{"$error":"#N/A"}},{"$f":"Alliance!T6","v":{"$error":"#N/A"}}]
["Ainsworth, Neb. (North-central Neb.)",{"$f":"Ainsworth!P6","v":{"$error":"#N/A"}},{"$f":"Ainsworth!Q6","v":{"$error":"#N/A"}},{"$f":"Ainsworth!R6","v":{"$error":"#N/A"}},{"$f":"Ainsworth!S6","v":{"$error":"#N/A"}},{"$f":"Ainsworth!T6","v":{"$error":"#N/A"}}]
["Scottsbluff, Neb. (N. Platte River Valley)",{"$f":"Scottsbluff!P6","v":{"$error":"#N/A"}},{"$f":"Scottsbluff!Q6","v":{"$error":"#N/A"}},{"$f":"Scottsbluff!R6","v":{"$error":"#N/A"}},{"$f":"Scottsbluff!S6","v":{"$error":"#N/A"}},{"$f":"Scottsbluff!T6","v":{"$error":"#N/A"}}]
["Beatrice, Neb. (Southeast Neb.)",{"$f":"Beatrice!P6","v":{"$error":"#N/A"}},{"$f":"Beatrice!Q6","v":{"$error":"#N/A"}},{"$f":"Beatrice!R6","v":{"$error":"#N/A"}},{"$f":"Beatrice!S6","v":{"$error":"#N/A"}},{"$f":"Beatrice!T6","v":{"$error":"#N/A"}}]
[]
["East/Southeast"]
["Annoyance free percentage",0.99,0.98,0.96,0.94,0.9]
["Grand Island, Neb. (South-central Neb.)",{"$f":"'Grand Island'!P32","v":{"$error":"#N/A"}},{"$f":"'Grand Island'!Q32","v":{"$error":"#N/A"}},{"$f":"'Grand Island'!R32","v":{"$error":"#N/A"}},{"$f":"'Grand Island'!S32","v":{"$error":"#N/A"}},{"$f":"'Grand Island'!T32","v":{"$error":"#N/A"}}]
["Lincoln, Neb. (Airport salt flats)",{"$f":"Lincoln!P32","v":{"$error":"#N/A"}},{"$f":"Lincoln!Q32","v":{"$error":"#N/A"}},{"$f":"Lincoln!R32","v":{"$error":"#N/A"}},{"$f":"Lincoln!S32","v":{"$error":"#N/A"}},{"$f":"Lincoln!T32","v":{"$error":"#N/A"}}]
["Norfolk, Neb. (Northeast Neb.)",{"$f":"Norfolk!P32","v":{"$error":"#N/A"}},{"$f":"Norfolk!Q32","v":{"$error":"#N/A"}},{"$f":"Norfolk!R32","v":{"$error":"#N/A"}},{"$f":"Norfolk!S32","v":{"$error":"#N/A"}},{"$f":"Norfolk!T32","v":{"$error":"#N/A"}}]
["North Platte, Neb. (Southwest Neb.)",{"$f":"'North Platte'!P32","v":{"$error":"#N/A"}},{"$f":"'North Platte'!Q32","v":{"$error":"#N/A"}},{"$f":"'North Platte'!R32","v":{"$error":"#N/A"}},{"$f":"'North Platte'!S32","v":{"$error":"#N/A"}},{"$f":"'North Platte'!T32","v":{"$error":"#N/A"}}]
["Alliance, Neb. (Neb. Panhandle)",{"$f":"Alliance!P32","v":{"$error":"#N/A"}},{"$f":"Alliance!Q32","v":{"$error":"#N/A"}},{"$f":"Alliance!R32","v":{"$error":"#N/A"}},{"$f":"Alliance!S32","v":{"$error":"#N/A"}},{"$f":"Alliance!T32","v":{"$error":"#N/A"}}]
["Ainsworth, Neb. (North-central Neb.)",{"$f":"Ainsworth!P31","v":{"$error":"#N/A"}},{"$f":"Ainsworth!Q31","v":{"$error":"#N/A"}},{"$f":"Ainsworth!R31","v":{"$error":"#N/A"}},{"$f":"Ainsworth!S31","v":{"$error":"#N/A"}},{"$f":"Ainsworth!T31","v":{"$error":"#N/A"}}]
["Scottsbluff, Neb. (N. Platte River Valley)",{"$f":"Scottsbluff!P32","v":{"$error":"#N/A"}},{"$f":"Scottsbluff!Q32","v":{"$error":"#N/A"}},{"$f":"Scottsbluff!R32","v":{"$error":"#N/A"}},{"$f":"Scottsbluff!S32","v":{"$error":"#N/A"}},{"$f":"Scottsbluff!T32","v":{"$error":"#N/A"}}]
["Beatrice, Neb. (Southeast Neb.)",{"$f":"Beatrice!P32","v":{"$error":"#N/A"}},{"$f":"Beatrice!Q32","v":{"$error":"#N/A"}},{"$f":"Beatrice!R32","v":{"$error":"#N/A"}},{"$f":"Beatrice!S32","v":{"$error":"#N/A"}},{"$f":"Beatrice!T32","v":{"$error":"#N/A"}}]
[]
["South/Southwest"]
["Annoyance free percentage",0.99,0.98,0.96,0.94,0.9]
["Grand Island, Neb. (South-central Neb.)",{"$f":"'Grand Island'!P58","v":{"$error":"#N/A"}},{"$f":"'Grand Island'!Q58","v":{"$error":"#N/A"}},{"$f":"'Grand Island'!R58","v":{"$error":"#N/A"}},{"$f":"'Grand Island'!S58","v":{"$error":"#N/A"}},{"$f":"'Grand Island'!T58","v":{"$error":"#N/A"}}]
["Lincoln, Neb. (Airport salt flats)",{"$f":"Lincoln!P58","v":{"$error":"#N/A"}},{"$f":"Lincoln!Q58","v":{"$error":"#N/A"}},{"$f":"Lincoln!R58","v":{"$error":"#N/A"}},{"$f":"Lincoln!S58","v":{"$error":"#N/A"}},{"$f":"Lincoln!T58","v":{"$error":"#N/A"}}]
["Norfolk, Neb. (Northeast Neb.)",{"$f":"Norfolk!P58","v":{"$error":"#N/A"}},{"$f":"Norfolk!Q58","v":{"$error":"#N/A"}},{"$f":"Norfolk!R58","v":{"$error":"#N/A"}},{"$f":"Norfolk!S58","v":{"$error":"#N/A"}},{"$f":"Norfolk!T58","v":{"$error":"#N/A"}}]
["North Platte, Neb. (Southwest Neb.)",{"$f":"'North Platte'!P58","v":{"$error":"#N/A"}},{"$f":"'North Platte'!Q58","v":{"$error":"#N/A"}},{"$f":"'North Platte'!R58","v":{"$error":"#N/A"}},{"$f":"'North Platte'!S58","v":{"$error":"#N/A"}},{"$f":"'North Platte'!T58","v":{"$error":"#N/A"}}]
["Alliance, Neb. (Neb. Panhandle)",{"$f":"Alliance!P58","v":{"$error":"#N/A"}},{"$f":"Alliance!Q58","v":{"$error":"#N/A"}},{"$f":"Alliance!R58","v":{"$error":"#N/A"}},{"$f":"Alliance!S58","v":{"$error":"#N/A"}},{"$f":"Alliance!T58","v":{"$error":"#N/A"}}]
["Ainsworth, Neb. (North-central Neb.)",{"$f":"Ainsworth!P56","v":{"$error":"#N/A"}},{"$f":"Ainsworth!Q56","v":{"$error":"#N/A"}},{"$f":"Ainsworth!R56","v":{"$error":"#N/A"}},{"$f":"Ainsworth!S56","v":{"$error":"#N/A"}},{"$f":"Ainsworth!T56","v":{"$error":"#N/A"}}]
["Scottsbluff, Neb. (N. Platte River Valley)",{"$f":"Scottsbluff!P58","v":{"$error":"#N/A"}},{"$f":"Scottsbluff!Q58","v":{"$error":"#N/A"}},{"$f":"Scottsbluff!R58","v":{"$error":"#N/A"}},{"$f":"Scottsbluff!S58","v":{"$error":"#N/A"}},{"$f":"Scottsbluff!T58","v":{"$error":"#N/A"}}]
["Beatrice, Neb. (Southeast Neb.)",{"$f":"Beatrice!P58","v":{"$error":"#N/A"}},{"$f":"Beatrice!Q58","v":{"$error":"#N/A"}},{"$f":"Beatrice!R58","v":{"$error":"#N/A"}},{"$f":"Beatrice!S58","v":{"$error":"#N/A"}},{"$f":"Beatrice!T58","v":{"$error":"#N/A"}}]
[]
["West/Northwest"]
["Annoyance free percentage",0.99,0.98,0.96,0.94,0.9]
["Grand Island, Neb. (South-central Neb.)",{"$f":"'Grand Island'!P84","v":{"$error":"#N/A"}},{"$f":"'Grand Island'!Q84","v":{"$error":"#N/A"}},{"$f":"'Grand Island'!R84","v":{"$error":"#N/A"}},{"$f":"'Grand Island'!S84","v":{"$error":"#N/A"}},{"$f":"'Grand Island'!T84","v":{"$error":"#N/A"}}]
["Lincoln, Neb. (Airport salt flats)",{"$f":"Lincoln!P84","v":{"$error":"#N/A"}},{"$f":"Lincoln!Q84","v":{"$error":"#N/A"}},{"$f":"Lincoln!R84","v":{"$error":"#N/A"}},{"$f":"Lincoln!S84","v":{"$error":"#N/A"}},{"$f":"Lincoln!T84","v":{"$error":"#N/A"}}]
["Norfolk, Neb. (Northeast Neb.)",{"$f":"Norfolk!P84","v":{"$error":"#N/A"}},{"$f":"Norfolk!Q84","v":{"$error":"#N/A"}},{"$f":"Norfolk!R84","v":{"$error":"#N/A"}},{"$f":"Norfolk!S84","v":{"$error":"#N/A"}},{"$f":"Norfolk!T84","v":{"$error":"#N/A"}}]
["North Platte, Neb. (Southwest Neb.)",{"$f":"'North Platte'!P84","v":{"$error":"#N/A"}},{"$f":"'North Platte'!Q84","v":{"$error":"#N/A"}},{"$f":"'North Platte'!R84","v":{"$error":"#N/A"}},{"$f":"'North Platte'!S84","v":{"$error":"#N/A"}},{"$f":"'North Platte'!T84","v":{"$error":"#N/A"}}]
["Alliance, Neb. (Neb. Panhandle)",{"$f":"Alliance!P84","v":{"$error":"#N/A"}},{"$f":"Alliance!Q84","v":{"$error":"#N/A"}},{"$f":"Alliance!R84","v":{"$error":"#N/A"}},{"$f":"Alliance!S84","v":{"$error":"#N/A"}},{"$f":"Alliance!T84","v":{"$error":"#N/A"}}]
["Ainsworth, Neb. (North-central Neb.)",{"$f":"Ainsworth!P81","v":{"$error":"#N/A"}},{"$f":"Ainsworth!Q81","v":{"$error":"#N/A"}},{"$f":"Ainsworth!R81","v":{"$error":"#N/A"}},{"$f":"Ainsworth!S81","v":{"$error":"#N/A"}},{"$f":"Ainsworth!T81","v":{"$error":"#N/A"}}]
["Scottsbluff, Neb. (N. Platte River Valley)",{"$f":"Scottsbluff!P84","v":{"$error":"#N/A"}},{"$f":"Scottsbluff!Q84","v":{"$error":"#N/A"}},{"$f":"Scottsbluff!R84","v":{"$error":"#N/A"}},{"$f":"Scottsbluff!S84","v":{"$error":"#N/A"}},{"$f":"Scottsbluff!T84","v":{"$error":"#N/A"}}]
["Beatrice, Neb. (Southeast Neb.)",{"$f":"Beatrice!P84","v":{"$error":"#N/A"}},{"$f":"Beatrice!Q84","v":{"$error":"#N/A"}},{"$f":"Beatrice!R84","v":{"$error":"#N/A"}},{"$f":"Beatrice!S84","v":{"$error":"#N/A"}},{"$f":"Beatrice!T84","v":{"$error":"#N/A"}}]